{"text_format":"1","workbook":"xlsx","n_sheets":18,"sheets":["Order_Entry","Order_Sheet","Database","IE2600A-250DS-A","IE2600A-250OS-A","Charts 2.5\" Angle","IE2600A-250-Angle_DATA","IE2600A-250DS-ST","IE2600A-250OS-ST","Charts- Each GPM","IE2600A-250-Straight_DATA","Charts 2.5\" Straight","Charts 1.5 Angle","Conditions","Old 2.5\" Charts","1.5\" Data (25psi increment)","IE2600A-150-DATA","Charts 1.5\" Angle"],"not_rendered":{"charts":151,"images":6,"macros":1,"external_links":0,"defined_names":44,"comments":0,"pivot_tables":0},"unopened":[],"bounds":{"document_bytes":16777216,"sheet_cells":100000,"rows_first":2000,"rows_last":500,"rows_between":2000,"halvings":0,"cell_chars":16384,"cell_head_chars":4096},"cells_cut":0,"cells_raw":0,"read":"whole","date_system":"1900"}

{"sheet":"Order_Entry","index":0,"n_rows":34,"n_cols":7,"rows_kept":34,"cut":false,"hidden":false,"merged":[[11,1,11,2],[12,1,12,2],[11,3,11,5],[12,3,12,5],[23,1,23,2],[22,1,22,2],[22,3,22,4],[23,3,23,4],[19,1,19,2],[20,1,20,2],[21,1,21,2],[19,3,19,4],[20,3,20,4],[21,3,21,4]]}
[]
[]
[]
[]
[]
[]
[]
[]
[]
[]
[null,"Information:"]
[null,"Project:"]
[null,"Date:",null,{"$f":"TODAY()","v":"2021-10-01"}]
[]
[null,"Valve Configuration:"]
[null,"Body Style","Inlet Connection","Outlet Connection","Valve Application","Monitoring Switch"]
[null,"Select...","Select...","Select...","Select...","Select..."]
[]
[null,"Operating Conditions:"]
[null,"Static Inlet Pressure:",null,null,null,"[psig]"]
[null,"Residual Inlet Pressure:",null,null,null,"[psig]"]
[null,"Flow Rate:"]
[null,"Desired Residual Outlet Pressure:",null,null,null,"[psig]"]
[null,"Location Tag:"]
[]
[null,"Valve Outputs:"]
[null,"Setting","Outlet Static Pressure (psig)","Outlet Residual Pressure (psig)","Difference to Desired Residual (psig)","Status","Quantity"]
[null,{"$f":"IFERROR(INDEX(Database!$D$37:$D$79, SMALL(IF(Database!$B$37:$B$79=Order_Entry!$B$17,ROW(Database!D$37:D$79)-ROW(Database!D$37)+1),ROWS(Database!D$37:'Database'!D37))),\"\")","v":""},{"$f":"IFERROR(INDEX(Database!$G$37:$G$79, SMALL(IF(Database!$B$37:$B$79=Order_Entry!$B$17,ROW(Database!G$37:G$79)-ROW(Database!G$37)+1),ROWS(Database!G$37:'Database'!G37))),\"\")","v":""},{"$f":"IFERROR(INDEX(Database!$H$37:$H$79, SMALL(IF(Database!$B$37:$B$79=Order_Entry!$B$17,ROW(Database!H$37:H$79)-ROW(Database!H$37)+1),ROWS(Database!H$37:'Database'!H37))),\"\")","v":""},{"$f":"IFERROR(INDEX(Database!$N$37:$N$79, SMALL(IF(Database!$B$37:$B$79=Order_Entry!$B$17,ROW(Database!N$37:N$79)-ROW(Database!N$37)+1),ROWS(Database!N$37:'Database'!N37))),\"\")","v":""},{"$f":"IFERROR(INDEX(Database!$O$37:$O$79, SMALL(IF(Database!$B$37:$B$79=Order_Entry!$B$17,ROW(Database!O$37:O$79)-ROW(Database!O$37)+1),ROWS(Database!O$37:'Database'!O37))),\"\")","v":""}]
[null,{"$f":"IFERROR(INDEX(Database!$D$37:$D$79, SMALL(IF(Database!$B$37:$B$79=Order_Entry!$B$17,ROW(Database!D$37:D$79)-ROW(Database!D$37)+1),ROWS(Database!D$37:'Database'!D38))),\"\")","v":""},{"$f":"IFERROR(INDEX(Database!$G$37:$G$79, SMALL(IF(Database!$B$37:$B$79=Order_Entry!$B$17,ROW(Database!G$37:G$79)-ROW(Database!G$37)+1),ROWS(Database!G$37:'Database'!G38))),\"\")","v":""},{"$f":"IFERROR(INDEX(Database!$H$37:$H$79, SMALL(IF(Database!$B$37:$B$79=Order_Entry!$B$17,ROW(Database!H$37:H$79)-ROW(Database!H$37)+1),ROWS(Database!H$37:'Database'!H38))),\"\")","v":""},{"$f":"IFERROR(INDEX(Database!$N$37:$N$79, SMALL(IF(Database!$B$37:$B$79=Order_Entry!$B$17,ROW(Database!N$37:N$79)-ROW(Database!N$37)+1),ROWS(Database!N$37:'Database'!N38))),\"\")","v":""},{"$f":"IFERROR(INDEX(Database!$O$37:$O$79, SMALL(IF(Database!$B$37:$B$79=Order_Entry!$B$17,ROW(Database!O$37:O$79)-ROW(Database!O$37)+1),ROWS(Database!O$37:'Database'!O38))),\"\")","v":""}]
[null,{"$f":"IFERROR(INDEX(Database!$D$37:$D$79, SMALL(IF(Database!$B$37:$B$79=Order_Entry!$B$17,ROW(Database!D$37:D$79)-ROW(Database!D$37)+1),ROWS(Database!D$37:'Database'!D39))),\"\")","v":""},{"$f":"IFERROR(INDEX(Database!$G$37:$G$79, SMALL(IF(Database!$B$37:$B$79=Order_Entry!$B$17,ROW(Database!G$37:G$79)-ROW(Database!G$37)+1),ROWS(Database!G$37:'Database'!G39))),\"\")","v":""},{"$f":"IFERROR(INDEX(Database!$H$37:$H$79, SMALL(IF(Database!$B$37:$B$79=Order_Entry!$B$17,ROW(Database!H$37:H$79)-ROW(Database!H$37)+1),ROWS(Database!H$37:'Database'!H39))),\"\")","v":""},{"$f":"IFERROR(INDEX(Database!$N$37:$N$79, SMALL(IF(Database!$B$37:$B$79=Order_Entry!$B$17,ROW(Database!N$37:N$79)-ROW(Database!N$37)+1),ROWS(Database!N$37:'Database'!N39))),\"\")","v":""},{"$f":"IFERROR(INDEX(Database!$O$37:$O$79, SMALL(IF(Database!$B$37:$B$79=Order_Entry!$B$17,ROW(Database!O$37:O$79)-ROW(Database!O$37)+1),ROWS(Database!O$37:'Database'!O39))),\"\")","v":""}]
[null,{"$f":"IFERROR(INDEX(Database!$D$37:$D$79, SMALL(IF(Database!$B$37:$B$79=Order_Entry!$B$17,ROW(Database!D$37:D$79)-ROW(Database!D$37)+1),ROWS(Database!D$37:'Database'!D40))),\"\")","v":""},{"$f":"IFERROR(INDEX(Database!$G$37:$G$79, SMALL(IF(Database!$B$37:$B$79=Order_Entry!$B$17,ROW(Database!G$37:G$79)-ROW(Database!G$37)+1),ROWS(Database!G$37:'Database'!G40))),\"\")","v":""},{"$f":"IFERROR(INDEX(Database!$H$37:$H$79, SMALL(IF(Database!$B$37:$B$79=Order_Entry!$B$17,ROW(Database!H$37:H$79)-ROW(Database!H$37)+1),ROWS(Database!H$37:'Database'!H40))),\"\")","v":""},{"$f":"IFERROR(INDEX(Database!$N$37:$N$79, SMALL(IF(Database!$B$37:$B$79=Order_Entry!$B$17,ROW(Database!N$37:N$79)-ROW(Database!N$37)+1),ROWS(Database!N$37:'Database'!N40))),\"\")","v":""},{"$f":"IFERROR(INDEX(Database!$O$37:$O$79, SMALL(IF(Database!$B$37:$B$79=Order_Entry!$B$17,ROW(Database!O$37:O$79)-ROW(Database!O$37)+1),ROWS(Database!O$37:'Database'!O40))),\"\")","v":""}]
[null,{"$f":"IFERROR(INDEX(Database!$D$37:$D$79, SMALL(IF(Database!$B$37:$B$79=Order_Entry!$B$17,ROW(Database!D$37:D$79)-ROW(Database!D$37)+1),ROWS(Database!D$37:'Database'!D41))),\"\")","v":""},{"$f":"IFERROR(INDEX(Database!$G$37:$G$79, SMALL(IF(Database!$B$37:$B$79=Order_Entry!$B$17,ROW(Database!G$37:G$79)-ROW(Database!G$37)+1),ROWS(Database!G$37:'Database'!G41))),\"\")","v":""},{"$f":"IFERROR(INDEX(Database!$H$37:$H$79, SMALL(IF(Database!$B$37:$B$79=Order_Entry!$B$17,ROW(Database!H$37:H$79)-ROW(Database!H$37)+1),ROWS(Database!H$37:'Database'!H41))),\"\")","v":""},{"$f":"IFERROR(INDEX(Database!$N$37:$N$79, SMALL(IF(Database!$B$37:$B$79=Order_Entry!$B$17,ROW(Database!N$37:N$79)-ROW(Database!N$37)+1),ROWS(Database!N$37:'Database'!N41))),\"\")","v":""},{"$f":"IFERROR(INDEX(Database!$O$37:$O$79, SMALL(IF(Database!$B$37:$B$79=Order_Entry!$B$17,ROW(Database!O$37:O$79)-ROW(Database!O$37)+1),ROWS(Database!O$37:'Database'!O41))),\"\")","v":""}]
[null,{"$f":"IFERROR(INDEX(Database!$D$37:$D$79, SMALL(IF(Database!$B$37:$B$79=Order_Entry!$B$17,ROW(Database!D$37:D$79)-ROW(Database!D$37)+1),ROWS(Database!D$37:'Database'!D42))),\"\")","v":""},{"$f":"IFERROR(INDEX(Database!$G$37:$G$79, SMALL(IF(Database!$B$37:$B$79=Order_Entry!$B$17,ROW(Database!G$37:G$79)-ROW(Database!G$37)+1),ROWS(Database!G$37:'Database'!G42))),\"\")","v":""},{"$f":"IFERROR(INDEX(Database!$H$37:$H$79, SMALL(IF(Database!$B$37:$B$79=Order_Entry!$B$17,ROW(Database!H$37:H$79)-ROW(Database!H$37)+1),ROWS(Database!H$37:'Database'!H42))),\"\")","v":""},{"$f":"IFERROR(INDEX(Database!$N$37:$N$79, SMALL(IF(Database!$B$37:$B$79=Order_Entry!$B$17,ROW(Database!N$37:N$79)-ROW(Database!N$37)+1),ROWS(Database!N$37:'Database'!N42))),\"\")","v":""},{"$f":"IFERROR(INDEX(Database!$O$37:$O$79, SMALL(IF(Database!$B$37:$B$79=Order_Entry!$B$17,ROW(Database!O$37:O$79)-ROW(Database!O$37)+1),ROWS(Database!O$37:'Database'!O42))),\"\")","v":""}]
[null,{"$f":"IFERROR(INDEX(Database!$D$37:$D$79, SMALL(IF(Database!$B$37:$B$79=Order_Entry!$B$17,ROW(Database!D$37:D$79)-ROW(Database!D$37)+1),ROWS(Database!D$37:'Database'!D43))),\"\")","v":""},{"$f":"IFERROR(INDEX(Database!$G$37:$G$79, SMALL(IF(Database!$B$37:$B$79=Order_Entry!$B$17,ROW(Database!G$37:G$79)-ROW(Database!G$37)+1),ROWS(Database!G$37:'Database'!G43))),\"\")","v":""},{"$f":"IFERROR(INDEX(Database!$H$37:$H$79, SMALL(IF(Database!$B$37:$B$79=Order_Entry!$B$17,ROW(Database!H$37:H$79)-ROW(Database!H$37)+1),ROWS(Database!H$37:'Database'!H43))),\"\")","v":""},{"$f":"IFERROR(INDEX(Database!$N$37:$N$79, SMALL(IF(Database!$B$37:$B$79=Order_Entry!$B$17,ROW(Database!N$37:N$79)-ROW(Database!N$37)+1),ROWS(Database!N$37:'Database'!N43))),\"\")","v":""},{"$f":"IFERROR(INDEX(Database!$O$37:$O$79, SMALL(IF(Database!$B$37:$B$79=Order_Entry!$B$17,ROW(Database!O$37:O$79)-ROW(Database!O$37)+1),ROWS(Database!O$37:'Database'!O43))),\"\")","v":""}]

{"sheet":"Order_Sheet","index":1,"n_rows":68,"n_cols":15,"rows_kept":68,"cut":false,"hidden":false,"merged":[[0,13,0,14],[66,0,66,1],[66,2,66,3],[66,10,66,11],[66,12,66,14],[44,0,44,1],[44,2,44,3],[44,10,44,11],[44,12,44,14],[0,0,0,1],[0,2,0,3],[0,10,0,11],[22,0,22,1],[22,2,22,3],[22,10,22,11],[22,13,22,14]]}
["Project Name:",null,{"$f":"IF(Order_Entry!$D$12=\"\",\"\",Order_Entry!$D$12)","v":""},null,null,null,null,null,null,null,"Date:",null,null,{"$f":"Order_Entry!$D$13","v":"2021-10-01"}]
["Order QTY","Body Style","Setting","Inlet Connection","Outlet Connection","Monitoring Switch","Location Tag",null,"Static Inlet [psig]","Residual Inlet [psig]","Flow Rate [gpm]","Desired Outlet [psig]",null,"Static Outlet [psig]","Residual Outlet [psig]"]
[]
[]
[]
[]
[]
[]
[]
[]
[]
[]
[]
[]
[]
[]
[]
[]
[]
[]
[]
[]
["Project Name:",null,{"$f":"IF(Order_Entry!$D$12=\"\",\"\",Order_Entry!$D$12)","v":""},null,null,null,null,null,null,null,"Date:",null,null,{"$f":"Order_Entry!$D$13","v":"2021-10-01"}]
["Order QTY","Body Style","Setting","Inlet Connection","Outlet Connection","Monitoring Switch","Location Tag",null,"Static Inlet [psig]","Residual Inlet [psig]","Flow Rate [gpm]","Desired Outlet [psig]",null,"Static Outlet [psig]","Residual Outlet [psig]"]
[]
[]
[]
[]
[]
[]
[]
[]
[]
[]
[]
[]
[]
[]
[]
[]
[]
[]
[]
[]
["Project Name:",null,{"$f":"IF(Order_Entry!$D$12=\"\",\"\",Order_Entry!$D$12)","v":""},null,null,null,null,null,null,null,"Date:",null,{"$f":"Order_Entry!$D$13","v":"2021-10-01"}]
["Order QTY","Body Style","Setting","Inlet Connection","Outlet Connection","Monitoring Switch","Location Tag",null,"Static Inlet [psig]","Residual Inlet [psig]","Flow Rate [gpm]","Desired Outlet [psig]",null,"Static Outlet [psig]","Residual Outlet [psig]"]
[]
[]
[]
[]
[]
[]
[]
[]
[]
[]
[]
[]
[]
[]
[]
[]
[]
[]
[]
[]
["Project Name:",null,{"$f":"IF(Order_Entry!$D$12=\"\",\"\",Order_Entry!$D$12)","v":""},null,null,null,null,null,null,null,"Date:",null,{"$f":"Order_Entry!$D$13","v":"2021-10-01"}]
["Order QTY","Body Style","Setting","Inlet Connection","Outlet Connection","Monitoring Switch","Location Tag",null,"Static Inlet [psig]","Residual Inlet [psig]","Flow Rate [gpm]","Desired Outlet [psig]",null,"Static Outlet [psig]","Residual Outlet [psig]"]

{"sheet":"Database","index":2,"n_rows":79,"n_cols":15,"rows_kept":79,"cut":false,"hidden":true,"merged":[[1,5,1,6],[2,5,2,6],[3,5,3,6],[4,1,4,3],[3,1,3,3],[2,1,2,3],[1,1,1,3]]}
["Variables"]
[null,"Static Inlet Pressure [psig]:",null,null,{"$f":"Order_Entry!$D$20","v":0},"Minimum Flow Rate [GPM]:",null,{"$f":"VLOOKUP(Main2,Database!$D$11:$I$12,6)","v":{"$error":"#N/A"}}]
[null,"Residual Inlet Pressure [psig]:",null,null,{"$f":"Order_Entry!$D$21","v":0},"Maximum Flow Rate [GPM]:",null,{"$f":"VLOOKUP(Main,Database!$B$11:$H$13,7)","v":0}]
[null,"Flow Rate [GPM]:",null,null,{"$f":"Order_Entry!$D$22","v":0},"Minimum Inlet Pressure [psig]:",null,50]
[null,"Desired Residual Outlet Pressure [psig]:",null,null,{"$f":"Order_Entry!$D$23","v":0}]
[]
[]
[]
["Drop-Down Options"]
[null,"Configuration","Reference","Application","Reference2","Sprinkler","Standpipe","Max Flow Rate","Min Flow Rate"]
[null,"1.5\" Angle","ValveA","Sprinkler System","Sprinkler","None","None",250,50]
[null,"2.5\" Angle","ValveB","Standpipe System","Standpipe","N.C. (Recom'd)","N.C. (Recom'd)",500,65]
[null,"2.5\" Straight","ValveC",null,null,"N.O.","N.O."]
[]
[null,"ValveA_Inlet","ValveA_Outlet","ValveB_Inlet","ValveB_Outlet","ValveC_Inlet","ValveC_Outlet"]
[null,"Female NPT","Female NPT","Female NPT","Female NPT","Female NPT","Female NPT"]
[null,"Grooved Pipe","Male Hose","Grooved Pipe","Regional Hose","Grooved Pipe","Grooved Pipe"]
[null,null,"Grooved Pipe",null,"Grooved Pipe"]
[]
[]
[]
["Error Messages"]
[null,"Code","Message"]
[null,"SC","Static Clear"]
[null,"RC","Res. Clear"]
[null,"FC","Flow Clear"]
[null,"Err1","Static inlet too high"]
[null,"Err2","Static inlet too low"]
[null,"Err3","Residual inlet too high"]
[null,"Err4","Residual inlet too low"]
[null,"Err5","Flow rate too high"]
[null,"Err6","Flow rate too low"]
[]
["Calculation Table"]
[]
[null,"Configuration","Spring Configuration","Bonnet Setting","Max Inlet Rating","Max Flow Rating","Calculated Static Outlet Pressure","Calculated Residual Outlet Pressure","Static Outlet Status","Residual Outlet Status","Flow Status","Static Outlet Display","Residual Outlet Display","Difference to Desired Residual Outlet Pressure","Status"]
[null,"1.5\" Angle","Single (Default)",1,340,350,{"$f":"'IE2600A-150-DATA'!AK19","v":{"$error":"#NUM!"}},{"$f":"'IE2600A-150-DATA'!AL19","v":{"$error":"#NUM!"}},{"$f":"IF($E$2<$H$4,$B$28,IF($E$2>$E$37,$B$27,$B$24))","v":"Err2"},{"$f":"IF($E$3<$H$4,$B$30,IF($E$3>$E$37,$B$29,$B$25))","v":"Err4"},{"$f":"IF($E$4<$H$2,$B$32,IF($E$4>$F$37,$B$31,$B$26))","v":{"$error":"#N/A"}},{"$f":"IF(AND($I$37=\"SC\",$J$37=\"RC\",$K$37=\"FC\"),$G$37, \"N/A\")","v":{"$error":"#N/A"}},{"$f":"IF(AND($I$37=\"SC\",$J$37=\"RC\",$K$37=\"FC\"),$H$37, \"N/A\")","v":{"$error":"#N/A"}},{"$f":"IF(AND($I$37=\"SC\",$J$37=\"RC\",$K$37=\"FC\",$E$5>0),(ABS($E$5-$M$37)), \"-\")","v":{"$error":"#N/A"}},{"$f":"IF(AND($I$37=\"SC\",$J$37=\"RC\",$K$37=\"FC\",$G$37<=176,$H$37<=175), \"AVAILABLE\", \"NOT AS PER NFPA\")","v":{"$error":"#N/A"}}]
[null,"1.5\" Angle","Single (Default)",2,285,350,{"$f":"'IE2600A-150-DATA'!AK20","v":{"$error":"#NUM!"}},{"$f":"'IE2600A-150-DATA'!AL20","v":{"$error":"#NUM!"}},{"$f":"IF($E$2<$H$4,$B$28,IF($E$2>$E$38,$B$27,$B$24))","v":"Err2"},{"$f":"IF($E$3<$H$4,$B$30,IF($E$3>$E$38,$B$29,$B$25))","v":"Err4"},{"$f":"IF($E$4<$H$2,$B$32,IF($E$4>$F$38,$B$31,$B$26))","v":{"$error":"#N/A"}},{"$f":"IF(AND($I$38=\"SC\",$J$38=\"RC\",$K$38=\"FC\"),$G$38, \"N/A\")","v":{"$error":"#N/A"}},{"$f":"IF(AND($I$38=\"SC\",$J$38=\"RC\",$K$38=\"FC\"),$H$38, \"N/A\")","v":{"$error":"#N/A"}},{"$f":"IF(AND($I$38=\"SC\",$J$38=\"RC\",$K$38=\"FC\",$E$5>0),(ABS($E$5-$M$38)), \"-\")","v":{"$error":"#N/A"}},{"$f":"IF(AND($I$38=\"SC\",$J$38=\"RC\",$K$38=\"FC\",$G$38<=176,$H$38<=175), \"AVAILABLE\", \"NOT AS PER NFPA\")","v":{"$error":"#N/A"}}]
[null,"1.5\" Angle","Single (Default)",3,220,350,{"$f":"'IE2600A-150-DATA'!AK21","v":{"$error":"#NUM!"}},{"$f":"'IE2600A-150-DATA'!AL21","v":{"$error":"#NUM!"}},{"$f":"IF($E$2<$H$4,$B$28,IF($E$2>$E$39,$B$27,$B$24))","v":"Err2"},{"$f":"IF($E$3<$H$4,$B$30,IF($E$3>$E$39,$B$29,$B$25))","v":"Err4"},{"$f":"IF($E$4<$H$2,$B$32,IF($E$4>$F$39,$B$31,$B$26))","v":{"$error":"#N/A"}},{"$f":"IF(AND($I$39=\"SC\",$J$39=\"RC\",$K$39=\"FC\"),$G$39, \"N/A\")","v":{"$error":"#N/A"}},{"$f":"IF(AND($I$39=\"SC\",$J$39=\"RC\",$K$39=\"FC\"),$H$39, \"N/A\")","v":{"$error":"#N/A"}},{"$f":"IF(AND($I$39=\"SC\",$J$39=\"RC\",$K$39=\"FC\",$E$5>0),(ABS($E$5-$M$39)), \"-\")","v":{"$error":"#N/A"}},{"$f":"IF(AND($I$39=\"SC\",$J$39=\"RC\",$K$39=\"FC\",$G$39<=176,$H$39<=175), \"AVAILABLE\", \"NOT AS PER NFPA\")","v":{"$error":"#N/A"}}]
[null,"1.5\" Angle","Single (Default)",4,175,350,{"$f":"'IE2600A-150-DATA'!AK22","v":{"$error":"#NUM!"}},{"$f":"'IE2600A-150-DATA'!AL22","v":{"$error":"#NUM!"}},{"$f":"IF($E$2<$H$4,$B$28,IF($E$2>$E$40,$B$27,$B$24))","v":"Err2"},{"$f":"IF($E$3<$H$4,$B$30,IF($E$3>$E$40,$B$29,$B$25))","v":"Err4"},{"$f":"IF($E$4<$H$2,$B$32,IF($E$4>$F$40,$B$31,$B$26))","v":{"$error":"#N/A"}},{"$f":"IF(AND($I$40=\"SC\",$J$40=\"RC\",$K$40=\"FC\"),$G$40, \"N/A\")","v":{"$error":"#N/A"}},{"$f":"IF(AND($I$40=\"SC\",$J$40=\"RC\",$K$40=\"FC\"),$H$40, \"N/A\")","v":{"$error":"#N/A"}},{"$f":"IF(AND($I$40=\"SC\",$J$40=\"RC\",$K$40=\"FC\",$E$5>0),(ABS($E$5-$M$40)), \"-\")","v":{"$error":"#N/A"}},{"$f":"IF(AND($I$40=\"SC\",$J$40=\"RC\",$K$40=\"FC\",$G$40<=176,$H$40<=175), \"AVAILABLE\", \"NOT AS PER NFPA\")","v":{"$error":"#N/A"}}]
[null,"1.5\" Angle","Single (Default)",5,175,350,{"$f":"'IE2600A-150-DATA'!AK23","v":{"$error":"#NUM!"}},{"$f":"'IE2600A-150-DATA'!AL23","v":{"$error":"#NUM!"}},{"$f":"IF($E$2<$H$4,$B$28,IF($E$2>$E$41,$B$27,$B$24))","v":"Err2"},{"$f":"IF($E$3<$H$4,$B$30,IF($E$3>$E$41,$B$29,$B$25))","v":"Err4"},{"$f":"IF($E$4<$H$2,$B$32,IF($E$4>$F$41,$B$31,$B$26))","v":{"$error":"#N/A"}},{"$f":"IF(AND($I$41=\"SC\",$J$41=\"RC\",$K$41=\"FC\"),$G$41, \"N/A\")","v":{"$error":"#N/A"}},{"$f":"IF(AND($I$41=\"SC\",$J$41=\"RC\",$K$41=\"FC\"),$H$41, \"N/A\")","v":{"$error":"#N/A"}},{"$f":"IF(AND($I$41=\"SC\",$J$41=\"RC\",$K$41=\"FC\",$E$5>0),(ABS($E$5-$M$41)), \"-\")","v":{"$error":"#N/A"}},{"$f":"IF(AND($I$41=\"SC\",$J$41=\"RC\",$K$41=\"FC\",$G$41<=176,$H$41<=175), \"AVAILABLE\", \"NOT AS PER NFPA\")","v":{"$error":"#N/A"}}]
[null,"1.5\" Angle","Single (Default)",6,175,350,{"$f":"'IE2600A-150-DATA'!AK24","v":{"$error":"#NUM!"}},{"$f":"'IE2600A-150-DATA'!AL24","v":{"$error":"#NUM!"}},{"$f":"IF($E$2<$H$4,$B$28,IF($E$2>$E$42,$B$27,$B$24))","v":"Err2"},{"$f":"IF($E$3<$H$4,$B$30,IF($E$3>$E$42,$B$29,$B$25))","v":"Err4"},{"$f":"IF($E$4<$H$2,$B$32,IF($E$4>$F$42,$B$31,$B$26))","v":{"$error":"#N/A"}},{"$f":"IF(AND($I$42=\"SC\",$J$42=\"RC\",$K$42=\"FC\"),$G$42, \"N/A\")","v":{"$error":"#N/A"}},{"$f":"IF(AND($I$42=\"SC\",$J$42=\"RC\",$K$42=\"FC\"),$H$42, \"N/A\")","v":{"$error":"#N/A"}},{"$f":"IF(AND($I$42=\"SC\",$J$42=\"RC\",$K$42=\"FC\",$E$5>0),(ABS($E$5-$M$42)), \"-\")","v":{"$error":"#N/A"}},{"$f":"IF(AND($I$42=\"SC\",$J$42=\"RC\",$K$42=\"FC\",$G$42<=176,$H$42<=175), \"AVAILABLE\", \"NOT AS PER NFPA\")","v":{"$error":"#N/A"}}]
[]
[]
[]
[]
[]
[]
[]
[]
[]
[]
[]
[]
[null,"2.5\" Angle","Single Small (IS)",1,400,500,{"$f":"'IE2600A-250-Angle_DATA'!AK19","v":{"$error":"#NUM!"}},{"$f":"'IE2600A-250-Angle_DATA'!AL19","v":{"$error":"#NUM!"}},{"$f":"IF($E$2<$H$4,$B$28,IF($E$2>$E$55,$B$27,$B$24))","v":"Err2"},{"$f":"IF($E$3<$H$4,$B$30,IF($E$3>$E$55,$B$29,$B$25))","v":"Err4"},{"$f":"IF($E$4<$H$2,$B$32,IF($E$4>$F$55,$B$31,$B$26))","v":{"$error":"#N/A"}},{"$f":"IF(AND($I$55=\"SC\",$J$55=\"RC\",$K$55=\"FC\"),$G$55, \"N/A\")","v":{"$error":"#N/A"}},{"$f":"IF(AND($I$55=\"SC\",$J$55=\"RC\",$K$55=\"FC\"),$H$55, \"N/A\")","v":{"$error":"#N/A"}},{"$f":"IF(AND($I$55=\"SC\",$J$55=\"RC\",$K$55=\"FC\",$E$5>0),(ABS($E$5-$M$55)), \"-\")","v":{"$error":"#N/A"}},{"$f":"IF(AND($I$55=\"SC\",$J$55=\"RC\",$K$55=\"FC\",$G$55<=176,$H$55<=175), \"AVAILABLE\", \"NOT AS PER NFPA\")","v":{"$error":"#N/A"}}]
[null,"2.5\" Angle","Single Small (IS)",2,375,500,{"$f":"'IE2600A-250-Angle_DATA'!AK20","v":{"$error":"#NUM!"}},{"$f":"'IE2600A-250-Angle_DATA'!AL20","v":{"$error":"#NUM!"}},{"$f":"IF($E$2<$H$4,$B$28,IF($E$2>$E$56,$B$27,$B$24))","v":"Err2"},{"$f":"IF($E$3<$H$4,$B$30,IF($E$3>$E$56,$B$29,$B$25))","v":"Err4"},{"$f":"IF($E$4<$H$2,$B$32,IF($E$4>$F$56,$B$31,$B$26))","v":{"$error":"#N/A"}},{"$f":"IF(AND($I$56=\"SC\",$J$56=\"RC\",$K$56=\"FC\"),$G$56, \"N/A\")","v":{"$error":"#N/A"}},{"$f":"IF(AND($I$56=\"SC\",$J$56=\"RC\",$K$56=\"FC\"),$H$56, \"N/A\")","v":{"$error":"#N/A"}},{"$f":"IF(AND($I$56=\"SC\",$J$56=\"RC\",$K$56=\"FC\",$E$5>0),(ABS($E$5-$M$56)), \"-\")","v":{"$error":"#N/A"}},{"$f":"IF(AND($I$56=\"SC\",$J$56=\"RC\",$K$56=\"FC\",$G$56<=176,$H$56<=175), \"AVAILABLE\", \"NOT AS PER NFPA\")","v":{"$error":"#N/A"}}]
[null,"2.5\" Angle","Single Small (IS)",3,345,500,{"$f":"'IE2600A-250-Angle_DATA'!AK21","v":{"$error":"#NUM!"}},{"$f":"'IE2600A-250-Angle_DATA'!AL21","v":{"$error":"#NUM!"}},{"$f":"IF($E$2<$H$4,$B$28,IF($E$2>$E$57,$B$27,$B$24))","v":"Err2"},{"$f":"IF($E$3<$H$4,$B$30,IF($E$3>$E$57,$B$29,$B$25))","v":"Err4"},{"$f":"IF($E$4<$H$2,$B$32,IF($E$4>$F$57,$B$31,$B$26))","v":{"$error":"#N/A"}},{"$f":"IF(AND($I$57=\"SC\",$J$57=\"RC\",$K$57=\"FC\"),$G$57, \"N/A\")","v":{"$error":"#N/A"}},{"$f":"IF(AND($I$57=\"SC\",$J$57=\"RC\",$K$57=\"FC\"),$H$57, \"N/A\")","v":{"$error":"#N/A"}},{"$f":"IF(AND($I$57=\"SC\",$J$57=\"RC\",$K$57=\"FC\",$E$5>0),(ABS($E$5-$M$57)), \"-\")","v":{"$error":"#N/A"}},{"$f":"IF(AND($I$57=\"SC\",$J$57=\"RC\",$K$57=\"FC\",$G$57<=176,$H$57<=175), \"AVAILABLE\", \"NOT AS PER NFPA\")","v":{"$error":"#N/A"}}]
[null,"2.5\" Angle","Single Small (IS)",4,310,500,{"$f":"'IE2600A-250-Angle_DATA'!AK22","v":{"$error":"#NUM!"}},{"$f":"'IE2600A-250-Angle_DATA'!AL22","v":{"$error":"#NUM!"}},{"$f":"IF($E$2<$H$4,$B$28,IF($E$2>$E$58,$B$27,$B$24))","v":"Err2"},{"$f":"IF($E$3<$H$4,$B$30,IF($E$3>$E$58,$B$29,$B$25))","v":"Err4"},{"$f":"IF($E$4<$H$2,$B$32,IF($E$4>$F$58,$B$31,$B$26))","v":{"$error":"#N/A"}},{"$f":"IF(AND($I$58=\"SC\",$J$58=\"RC\",$K$58=\"FC\"),$G$58, \"N/A\")","v":{"$error":"#N/A"}},{"$f":"IF(AND($I$58=\"SC\",$J$58=\"RC\",$K$58=\"FC\"),$H$58, \"N/A\")","v":{"$error":"#N/A"}},{"$f":"IF(AND($I$58=\"SC\",$J$58=\"RC\",$K$58=\"FC\",$E$5>0),(ABS($E$5-$M$58)), \"-\")","v":{"$error":"#N/A"}},{"$f":"IF(AND($I$58=\"SC\",$J$58=\"RC\",$K$58=\"FC\",$G$58<=176,$H$58<=175), \"AVAILABLE\", \"NOT AS PER NFPA\")","v":{"$error":"#N/A"}}]
[null,"2.5\" Angle","Single Small (IS)",5,275,500,{"$f":"'IE2600A-250-Angle_DATA'!AK23","v":{"$error":"#NUM!"}},{"$f":"'IE2600A-250-Angle_DATA'!AL23","v":{"$error":"#NUM!"}},{"$f":"IF($E$2<$H$4,$B$28,IF($E$2>$E$59,$B$27,$B$24))","v":"Err2"},{"$f":"IF($E$3<$H$4,$B$30,IF($E$3>$E$59,$B$29,$B$25))","v":"Err4"},{"$f":"IF($E$4<$H$2,$B$32,IF($E$4>$F$59,$B$31,$B$26))","v":{"$error":"#N/A"}},{"$f":"IF(AND($I$59=\"SC\",$J$59=\"RC\",$K$59=\"FC\"),$G$59, \"N/A\")","v":{"$error":"#N/A"}},{"$f":"IF(AND($I$59=\"SC\",$J$59=\"RC\",$K$59=\"FC\"),$H$59, \"N/A\")","v":{"$error":"#N/A"}},{"$f":"IF(AND($I$59=\"SC\",$J$59=\"RC\",$K$59=\"FC\",$E$5>0),(ABS($E$5-$M$59)), \"-\")","v":{"$error":"#N/A"}},{"$f":"IF(AND($I$59=\"SC\",$J$59=\"RC\",$K$59=\"FC\",$G$59<=176,$H$59<=175), \"AVAILABLE\", \"NOT AS PER NFPA\")","v":{"$error":"#N/A"}}]
[null,"2.5\" Angle","Single Small (IS)",6,230,500,{"$f":"'IE2600A-250-Angle_DATA'!AK24","v":{"$error":"#NUM!"}},{"$f":"'IE2600A-250-Angle_DATA'!AL24","v":{"$error":"#NUM!"}},{"$f":"IF($E$2<$H$4,$B$28,IF($E$2>$E$60,$B$27,$B$24))","v":"Err2"},{"$f":"IF($E$3<$H$4,$B$30,IF($E$3>$E$60,$B$29,$B$25))","v":"Err4"},{"$f":"IF($E$4<$H$2,$B$32,IF($E$4>$F$60,$B$31,$B$26))","v":{"$error":"#N/A"}},{"$f":"IF(AND($I$60=\"SC\",$J$60=\"RC\",$K$60=\"FC\"),$G$60, \"N/A\")","v":{"$error":"#N/A"}},{"$f":"IF(AND($I$60=\"SC\",$J$60=\"RC\",$K$60=\"FC\"),$H$60, \"N/A\")","v":{"$error":"#N/A"}},{"$f":"IF(AND($I$60=\"SC\",$J$60=\"RC\",$K$60=\"FC\",$E$5>0),(ABS($E$5-$M$60)), \"-\")","v":{"$error":"#N/A"}},{"$f":"IF(AND($I$60=\"SC\",$J$60=\"RC\",$K$60=\"FC\",$G$60<=176,$H$60<=175), \"AVAILABLE\", \"NOT AS PER NFPA\")","v":{"$error":"#N/A"}}]
[null,"2.5\" Angle","Single Small (IS)",7,175,500,{"$f":"'IE2600A-250-Angle_DATA'!AK25","v":{"$error":"#NUM!"}},{"$f":"'IE2600A-250-Angle_DATA'!AL25","v":{"$error":"#NUM!"}},{"$f":"IF($E$2<$H$4,$B$28,IF($E$2>$E$61,$B$27,$B$24))","v":"Err2"},{"$f":"IF($E$3<$H$4,$B$30,IF($E$3>$E$61,$B$29,$B$25))","v":"Err4"},{"$f":"IF($E$4<$H$2,$B$32,IF($E$4>$F$61,$B$31,$B$26))","v":{"$error":"#N/A"}},{"$f":"IF(AND($I$61=\"SC\",$J$61=\"RC\",$K$61=\"FC\"),$G$61, \"N/A\")","v":{"$error":"#N/A"}},{"$f":"IF(AND($I$61=\"SC\",$J$61=\"RC\",$K$61=\"FC\"),$H$61, \"N/A\")","v":{"$error":"#N/A"}},{"$f":"IF(AND($I$61=\"SC\",$J$61=\"RC\",$K$61=\"FC\",$E$5>0),(ABS($E$5-$M$61)), \"-\")","v":{"$error":"#N/A"}},{"$f":"IF(AND($I$61=\"SC\",$J$61=\"RC\",$K$61=\"FC\",$G$61<=176,$H$61<=175), \"AVAILABLE\", \"NOT AS PER NFPA\")","v":{"$error":"#N/A"}}]
[]
[]
[]
[]
[]
[]
[]
[]
[]
[]
[]
[null,"2.5\" Straight","Single (Default)",1,400,500,{"$f":"'IE2600A-250-Straight_DATA'!AK19","v":{"$error":"#NUM!"}},{"$f":"'IE2600A-250-Straight_DATA'!AL19","v":{"$error":"#NUM!"}},{"$f":"IF($E$2<$H$4,$B$28,IF($E$2>$E$73,$B$27,$B$24))","v":"Err2"},{"$f":"IF($E$3<$H$4,$B$30,IF($E$3>$E$73,$B$29,$B$25))","v":"Err4"},{"$f":"IF($E$4<$H$2,$B$32,IF($E$4>$F$73,$B$31,$B$26))","v":{"$error":"#N/A"}},{"$f":"IF(AND($I$73=\"SC\",$J$73=\"RC\",$K$73=\"FC\"),$G$73, \"N/A\")","v":{"$error":"#N/A"}},{"$f":"IF(AND($I$73=\"SC\",$J$73=\"RC\",$K$73=\"FC\"),$H$73, \"N/A\")","v":{"$error":"#N/A"}},{"$f":"IF(AND($I$73=\"SC\",$J$73=\"RC\",$K$73=\"FC\",$E$5>0),(ABS($E$5-$M$73)), \"-\")","v":{"$error":"#N/A"}},{"$f":"IF(AND($I$73=\"SC\",$J$73=\"RC\",$K$73=\"FC\",$G$73<=176,$H$73<=175), \"AVAILABLE\", \"NOT AS PER NFPA\")","v":{"$error":"#N/A"}}]
[null,"2.5\" Straight","Single (Default)",2,390,500,{"$f":"'IE2600A-250-Straight_DATA'!AK20","v":{"$error":"#NUM!"}},{"$f":"'IE2600A-250-Straight_DATA'!AL20","v":{"$error":"#NUM!"}},{"$f":"IF($E$2<$H$4,$B$28,IF($E$2>$E$74,$B$27,$B$24))","v":"Err2"},{"$f":"IF($E$3<$H$4,$B$30,IF($E$3>$E$74,$B$29,$B$25))","v":"Err4"},{"$f":"IF($E$4<$H$2,$B$32,IF($E$4>$F$74,$B$31,$B$26))","v":{"$error":"#N/A"}},{"$f":"IF(AND($I$74=\"SC\",$J$74=\"RC\",$K$74=\"FC\"),$G$74, \"N/A\")","v":{"$error":"#N/A"}},{"$f":"IF(AND($I$74=\"SC\",$J$74=\"RC\",$K$74=\"FC\"),$H$74, \"N/A\")","v":{"$error":"#N/A"}},{"$f":"IF(AND($I$74=\"SC\",$J$74=\"RC\",$K$74=\"FC\",$E$5>0),(ABS($E$5-$M$74)), \"-\")","v":{"$error":"#N/A"}},{"$f":"IF(AND($I$74=\"SC\",$J$74=\"RC\",$K$74=\"FC\",$G$74<=176,$H$74<=175), \"AVAILABLE\", \"NOT AS PER NFPA\")","v":{"$error":"#N/A"}}]
[null,"2.5\" Straight","Single (Default)",3,355,500,{"$f":"'IE2600A-250-Straight_DATA'!AK21","v":{"$error":"#NUM!"}},{"$f":"'IE2600A-250-Straight_DATA'!AL21","v":{"$error":"#NUM!"}},{"$f":"IF($E$2<$H$4,$B$28,IF($E$2>$E$75,$B$27,$B$24))","v":"Err2"},{"$f":"IF($E$3<$H$4,$B$30,IF($E$3>$E$75,$B$29,$B$25))","v":"Err4"},{"$f":"IF($E$4<$H$2,$B$32,IF($E$4>$F$75,$B$31,$B$26))","v":{"$error":"#N/A"}},{"$f":"IF(AND($I$75=\"SC\",$J$75=\"RC\",$K$75=\"FC\"),$G$75, \"N/A\")","v":{"$error":"#N/A"}},{"$f":"IF(AND($I$75=\"SC\",$J$75=\"RC\",$K$75=\"FC\"),$H$75, \"N/A\")","v":{"$error":"#N/A"}},{"$f":"IF(AND($I$75=\"SC\",$J$75=\"RC\",$K$75=\"FC\",$E$5>0),(ABS($E$5-$M$75)), \"-\")","v":{"$error":"#N/A"}},{"$f":"IF(AND($I$75=\"SC\",$J$75=\"RC\",$K$75=\"FC\",$G$75<=176,$H$75<=175), \"AVAILABLE\", \"NOT AS PER NFPA\")","v":{"$error":"#N/A"}}]
[null,"2.5\" Straight","Single (Default)",4,315,500,{"$f":"'IE2600A-250-Straight_DATA'!AK22","v":{"$error":"#NUM!"}},{"$f":"'IE2600A-250-Straight_DATA'!AL22","v":{"$error":"#NUM!"}},{"$f":"IF($E$2<$H$4,$B$28,IF($E$2>$E$76,$B$27,$B$24))","v":"Err2"},{"$f":"IF($E$3<$H$4,$B$30,IF($E$3>$E$76,$B$29,$B$25))","v":"Err4"},{"$f":"IF($E$4<$H$2,$B$32,IF($E$4>$F$76,$B$31,$B$26))","v":{"$error":"#N/A"}},{"$f":"IF(AND($I$76=\"SC\",$J$76=\"RC\",$K$76=\"FC\"),$G$76, \"N/A\")","v":{"$error":"#N/A"}},{"$f":"IF(AND($I$76=\"SC\",$J$76=\"RC\",$K$76=\"FC\"),$H$76, \"N/A\")","v":{"$error":"#N/A"}},{"$f":"IF(AND($I$76=\"SC\",$J$76=\"RC\",$K$76=\"FC\",$E$5>0),(ABS($E$5-$M$76)), \"-\")","v":{"$error":"#N/A"}},{"$f":"IF(AND($I$76=\"SC\",$J$76=\"RC\",$K$76=\"FC\",$G$76<=176,$H$76<=175), \"AVAILABLE\", \"NOT AS PER NFPA\")","v":{"$error":"#N/A"}}]
[null,"2.5\" Straight","Single (Default)",5,280,500,{"$f":"'IE2600A-250-Straight_DATA'!AK23","v":{"$error":"#NUM!"}},{"$f":"'IE2600A-250-Straight_DATA'!AL23","v":{"$error":"#NUM!"}},{"$f":"IF($E$2<$H$4,$B$28,IF($E$2>$E$77,$B$27,$B$24))","v":"Err2"},{"$f":"IF($E$3<$H$4,$B$30,IF($E$3>$E$77,$B$29,$B$25))","v":"Err4"},{"$f":"IF($E$4<$H$2,$B$32,IF($E$4>$F$77,$B$31,$B$26))","v":{"$error":"#N/A"}},{"$f":"IF(AND($I$77=\"SC\",$J$77=\"RC\",$K$77=\"FC\"),$G$77, \"N/A\")","v":{"$error":"#N/A"}},{"$f":"IF(AND($I$77=\"SC\",$J$77=\"RC\",$K$77=\"FC\"),$H$77, \"N/A\")","v":{"$error":"#N/A"}},{"$f":"IF(AND($I$77=\"SC\",$J$77=\"RC\",$K$77=\"FC\",$E$5>0),(ABS($E$5-$M$77)), \"-\")","v":{"$error":"#N/A"}},{"$f":"IF(AND($I$77=\"SC\",$J$77=\"RC\",$K$77=\"FC\",$G$77<=176,$H$77<=175), \"AVAILABLE\", \"NOT AS PER NFPA\")","v":{"$error":"#N/A"}}]
[null,"2.5\" Straight","Single (Default)",6,240,500,{"$f":"'IE2600A-250-Straight_DATA'!AK24","v":{"$error":"#NUM!"}},{"$f":"'IE2600A-250-Straight_DATA'!AL24","v":{"$error":"#NUM!"}},{"$f":"IF($E$2<$H$4,$B$28,IF($E$2>$E$78,$B$27,$B$24))","v":"Err2"},{"$f":"IF($E$3<$H$4,$B$30,IF($E$3>$E$78,$B$29,$B$25))","v":"Err4"},{"$f":"IF($E$4<$H$2,$B$32,IF($E$4>$F$78,$B$31,$B$26))","v":{"$error":"#N/A"}},{"$f":"IF(AND($I$78=\"SC\",$J$78=\"RC\",$K$78=\"FC\"),$G$78, \"N/A\")","v":{"$error":"#N/A"}},{"$f":"IF(AND($I$78=\"SC\",$J$78=\"RC\",$K$78=\"FC\"),$H$78, \"N/A\")","v":{"$error":"#N/A"}},{"$f":"IF(AND($I$78=\"SC\",$J$78=\"RC\",$K$78=\"FC\",$E$5>0),(ABS($E$5-$M$78)), \"-\")","v":{"$error":"#N/A"}},{"$f":"IF(AND($I$78=\"SC\",$J$78=\"RC\",$K$78=\"FC\",$G$78<=176,$H$78<=175), \"AVAILABLE\", \"NOT AS PER NFPA\")","v":{"$error":"#N/A"}}]
[null,"2.5\" Straight","Single (Default)",7,175,500,{"$f":"'IE2600A-250-Straight_DATA'!AK25","v":{"$error":"#NUM!"}},{"$f":"'IE2600A-250-Straight_DATA'!AL25","v":{"$error":"#NUM!"}},{"$f":"IF($E$2<$H$4,$B$28,IF($E$2>$E$79,$B$27,$B$24))","v":"Err2"},{"$f":"IF($E$3<$H$4,$B$30,IF($E$3>$E$79,$B$29,$B$25))","v":"Err4"},{"$f":"IF($E$4<$H$2,$B$32,IF($E$4>$F$79,$B$31,$B$26))","v":{"$error":"#N/A"}},{"$f":"IF(AND($I$79=\"SC\",$J$79=\"RC\",$K$79=\"FC\"),$G$79, \"N/A\")","v":{"$error":"#N/A"}},{"$f":"IF(AND($I$79=\"SC\",$J$79=\"RC\",$K$79=\"FC\"),$H$79, \"N/A\")","v":{"$error":"#N/A"}},{"$f":"IF(AND($I$79=\"SC\",$J$79=\"RC\",$K$79=\"FC\",$E$5>0),(ABS($E$5-$M$79)), \"-\")","v":{"$error":"#N/A"}},{"$f":"IF(AND($I$79=\"SC\",$J$79=\"RC\",$K$79=\"FC\",$G$79<=176,$H$79<=175), \"AVAILABLE\", \"NOT AS PER NFPA\")","v":{"$error":"#N/A"}}]

{"sheet":"IE2600A-250DS-A","index":3,"n_rows":167,"n_cols":50,"rows_kept":167,"cut":false,"hidden":true,"merged":[[22,45,22,46],[23,45,23,46],[17,45,17,46],[18,45,18,46],[19,45,19,46],[20,45,20,46],[21,45,21,46],[31,34,32,34],[31,35,32,35],[31,36,32,36],[45,34,46,34],[45,35,46,35],[45,36,46,36],[2,34,2,42],[16,34,16,42],[17,39,18,40],[30,34,30,42],[3,35,4,35],[3,36,4,36],[3,34,4,34],[17,34,18,34],[17,35,18,35],[17,36,18,36],[73,34,74,34],[73,35,74,35],[73,36,74,36],[72,34,72,42],[73,39,74,40],[0,0,0,23],[2,1,2,7],[16,1,16,7],[30,1,30,7],[44,1,44,7],[2,10,3,10],[2,11,3,11],[4,10,12,10],[30,12,30,23],[32,10,40,10],[44,10,45,10],[44,11,45,11],[44,12,44,23],[2,12,2,23],[58,1,58,7],[16,12,16,23],[18,10,26,10],[156,1,156,7],[86,1,86,7],[100,1,100,7],[114,1,114,7],[128,1,128,7],[142,1,142,7],[72,1,72,7],[30,10,31,10],[30,11,31,11],[16,10,17,10],[16,11,17,11],[72,10,73,10],[72,11,73,11],[72,12,72,23],[74,10,82,10],[46,10,54,10],[58,10,59,10],[58,11,59,11],[58,12,58,23],[60,10,68,10],[2,26,2,31],[16,26,16,31],[30,26,30,31],[44,26,44,31],[58,26,58,31],[72,26,72,31],[3,45,3,49],[4,45,4,47],[5,45,5,47],[6,45,6,47],[7,45,7,47],[8,45,8,47],[3,39,4,40],[31,39,32,40],[44,34,44,42],[45,39,46,40],[58,34,58,42],[59,39,60,40],[59,34,60,34],[59,35,60,35],[59,36,60,36]]}
["Data from Project# 4788271148, Date: 2018-05-09"]
[]
[null,"STATIC FLOW",null,null,null,null,null,null,null,null,"Bonnet Setting","Inlet Pressure psig","OUTLET PRESSURES @ FLOW RATE, GPM",null,null,null,null,null,null,null,null,null,null,null,null,null,"Setting # 1: Inlet vs. Outlet Pressure Over Flow Range",null,null,null,null,null,null,null,"SETTING 1"]
[null,"Inlet (psig)","Outlet-1 (psig)","Outlet-2 (psig)","Outlet-3 (psig)","Outlet-4 (psig)","Outlet-5 (psig)","Outlet-6 (psig)",null,null,null,null,0,50,100,150,175,200,250,300,350,400,450,500,null,null,"Inlet (psig)","Static","50-200 [GPM]","200-300 [GPM]","300-400 [GPM]","400-500 [GPM]",null,null,"Inlet (psig)",{"$f":"CONCATENATE(\"Outlet Residual @ \" &AX$8& \" GPM\")","v":"Outlet Residual @ 0 GPM"},{"$f":"CONCATENATE(\"Outlet Residual @ \" &AX$9& \" GPM\")","v":"Outlet Residual @ 0 GPM"},null,null,"Const. PRI Interpolated @ Var. Flow",null,null,null,null,null,"VARIABLES"]
[null,0,{"$f":"M5","v":0},{"$f":"M19","v":0},{"$f":"M33","v":0},{"$f":"M47","v":0},{"$f":"M61","v":0},{"$f":"M75","v":0},null,null,1,0,null,null,null,null,null,null,null,null,null,null,null,null,null,null,{"$f":"L5","v":0},null,null,null,null,null,null,null,null,null,null,null,null,null,null,null,null,null,null,"Static Inlet Pressure",null,null,"PSI:",{"$f":"Database!$E$2","v":0}]
[null,50,50,48,47,{"$f":"M48","v":49},{"$f":"M62","v":50},{"$f":"M76","v":50},null,null,null,50,50,48,39,35,29,28,15,null,null,null,null,null,null,null,{"$f":"L6","v":50},{"$f":"M6","v":50},{"$f":"AVERAGE(N6:R6)","v":35.799999999999997},{"$f":"AVERAGE(R6:T6)","v":21.5},{"$f":"AVERAGE(T6:V6)","v":{"$error":"#DIV/0!"}},{"$f":"AVERAGE(V6:X6)","v":{"$error":"#DIV/0!"}},null,null,{"$f":"L6","v":50},{"$f":"HLOOKUP($AX$8,$M$4:$X$13,3)","v":50},{"$f":"HLOOKUP($AX$9,$M$4:$X$13,3)","v":50},"PRI1:",{"$f":"LARGE(L6:L13,COUNTIF(L6:L13,\">\" &AX6)+1)","v":{"$error":"#NUM!"}},{"$f":"VLOOKUP(AM6,AI6:AK13,2)","v":{"$error":"#NUM!"}},{"$f":"VLOOKUP(AM6,AI6:AK13,3)","v":{"$error":"#NUM!"}},"PRO1:",{"$f":"IF(AX8=AX9, AN6, FORECAST(AX7,$AN$6:$AO$6,$AX$8:$AX$9))","v":{"$error":"#NUM!"}},null,null,"Residual Inlet Pressure",null,null,"PRI:",{"$f":"Database!$E$3","v":0}]
[null,100,91,100,100,{"$f":"M49","v":100},{"$f":"M63","v":100},{"$f":"M77","v":100},null,null,null,100,91,89,72,64,60,59,51,44,31,null,null,null,null,null,100,{"$f":"M7","v":91},{"$f":"AVERAGE(N7:R7)","v":68.8},{"$f":"AVERAGE(R7:T7)","v":51.333333333333336},{"$f":"AVERAGE(T7:V7)","v":37.5},{"$f":"AVERAGE(V7:X7)","v":{"$error":"#DIV/0!"}},null,null,{"$f":"L7","v":100},{"$f":"HLOOKUP($AX$8,$M$4:$X$13,4)","v":91},{"$f":"HLOOKUP($AX$9,$M$4:$X$13,4)","v":91},"PRI2:",{"$f":"SMALL(L6:L13,COUNTIF(L6:L13,\"<\" &AX6)+1)","v":50},{"$f":"VLOOKUP(AM7,AI6:AK13,2)","v":50},{"$f":"VLOOKUP(AM7,AI6:AK13,3)","v":50},"PRO2:",{"$f":"IF(AX8=AX9, AN7, FORECAST(AX7,$AN$7:$AO$7,$AX$8:$AX$9))","v":50},null,null,"Flow Rate",null,null,"Q0:",{"$f":"IF(Database!$E$4=500,499.99,Database!$E$4)","v":0}]
[null,150,116,140,150,150,150,150,null,null,null,150,116,103,96,89,88,85,77,70,62,56,39,null,null,null,150,116,92.2,77.333333333333329,62.666666666666664,47.5,null,null,150,{"$f":"HLOOKUP($AX$8,$M$4:$X$13,5)","v":116},{"$f":"HLOOKUP($AX$9,$M$4:$X$13,5)","v":116},"PSI1:",{"$f":"LARGE(L6:L13,COUNTIF(L6:L13,\">\" &AX5)+1)","v":{"$error":"#NUM!"}},null,null,"PSO1:",{"$f":"VLOOKUP(AM8,L6:M13,2)","v":{"$error":"#NUM!"}},null,null,"Nearest known Flow Rate, 1",null,null,"Q1:",{"$f":"LARGE(M4:X4,COUNTIF(M4:X4,\">\" &AX7)+1)","v":0}]
[null,200,136,163,193,200,200,200,null,null,null,200,136,123,116,114,111,109,100,94,89,81,73,63,null,null,200,136,114.6,101,88,72.333333333333329,null,null,200,{"$f":"HLOOKUP($AX$8,$M$4:$X$13,6)","v":136},{"$f":"HLOOKUP($AX$9,$M$4:$X$13,6)","v":136},"PSI2:",{"$f":"SMALL(L6:L13,COUNTIF(L6:L13,\"<\" &AX5)+1)","v":50},null,null,"PSO2:",{"$f":"VLOOKUP(AM9,L6:M13,2)","v":50},null,null,"Nearest known Flow Rate, 2",null,null,"Q2:",{"$f":"SMALL(M4:X4,COUNTIF(M4:X4,\"<\" &AX7)+1)","v":0}]
[null,250,156,182,214,248,250,250,null,null,null,250,156,143,136,132,130,127,122,116,111,103,97,90,null,null,250,156,133.6,121.66666666666667,110,96.666666666666671,null,null,250,{"$f":"HLOOKUP($AX$8,$M$4:$X$13,7)","v":156},{"$f":"HLOOKUP($AX$9,$M$4:$X$13,7)","v":156}]
[null,300,176,203,235,265,297,300,null,null,null,300,176,167,157,150,148,146,142,136,130,125,118,111,null,null,300,176,153.6,141.33333333333334,130.33333333333334,118,null,null,300,{"$f":"HLOOKUP($AX$8,$M$4:$X$13,8)","v":176},{"$f":"HLOOKUP($AX$9,$M$4:$X$13,8)","v":176}]
[null,350,194,223,254,282,320,348,null,null,null,350,194,185,172,170,168,164,161,155,150,144,138,131,null,null,350,194,171.8,160,149.66666666666666,137.66666666666666,null,null,350,{"$f":"HLOOKUP($AX$8,$M$4:$X$13,9)","v":194},{"$f":"HLOOKUP($AX$9,$M$4:$X$13,9)","v":194}]
[null,400,216,243,273,305,338,368,null,null,null,400,216,208,197,190,186,186,178,176,170,164,157,152,null,null,400,216,193.4,180,170,157.66666666666666,null,null,400,{"$f":"HLOOKUP($AX$8,$M$4:$X$13,10)","v":216},{"$f":"HLOOKUP($AX$9,$M$4:$X$13,10)","v":216}]
[]
[]
[]
[null,"50 GPM FLOW RATE",null,null,null,null,null,null,null,null,"Bonnet Setting","Inlet Pressure psig","OUTLET PRESSURES @ FLOW RATE, GPM",null,null,null,null,null,null,null,null,null,null,null,null,null,"Setting # 2: Inlet vs. Outlet Pressure Over Flow Range",null,null,null,null,null,null,null,"SETTING 2"]
[null,"Inlet (psig)","Outlet-1 (psig)","Outlet-2 (psig)","Outlet-3 (psig)","Outlet-4 (psig)","Outlet-5 (psig)","Outlet-6 (psig)",null,null,null,null,0,50,100,150,175,200,250,300,350,400,450,500,null,null,"Inlet (psig)","Static","50-200 [GPM]","200-300 [GPM]","300-400 [GPM]","400-500 [GPM]",null,null,"Inlet (psig)",{"$f":"CONCATENATE(\"Outlet Residual @ \" &AX$8& \" GPM\")","v":"Outlet Residual @ 0 GPM"},{"$f":"CONCATENATE(\"Outlet Residual @ \" &AX$9& \" GPM\")","v":"Outlet Residual @ 0 GPM"},null,null,"Const. PRI Interpolated @ Var. Flow",null,null,null,null,null,"2.5\" Angle Double Spring",null,"Calculated Static Outlet Pressure","Calculated Residual Outlet Pressure","Max Flow Rate"]
[null,0,{"$f":"N5","v":0},{"$f":"N19","v":0},{"$f":"N33","v":0},{"$f":"N47","v":0},{"$f":"N61","v":0},{"$f":"N75","v":0},null,null,2,0,null,null,null,null,null,null,null,null,null,null,null,null,null,null,{"$f":"L19","v":0},null,null,null,null,null,null,null,null,null,null,null,null,null,null,null,null,null,null,"Setting 1",null,{"$f":"IF($AQ$8=$AQ$9,$AQ$8,FORECAST($AX$5,$AQ$8:$AQ$9,$AM$8:$AM$9))","v":{"$error":"#NUM!"}},{"$f":"IF($AQ$6=$AQ$7,$AQ$6,FORECAST($AX$6,$AQ$6:$AQ$7,$AM$6:$AM$7))","v":{"$error":"#NUM!"}},500]
[null,50,48,50,{"$f":"N34","v":47},{"$f":"N48","v":49},{"$f":"N62","v":50},{"$f":"N76","v":50},null,null,null,50,48,50,43,37,32,28,14,null,null,null,null,null,null,null,{"$f":"L20","v":50},{"$f":"M20","v":48},{"$f":"AVERAGE(N20:R20)","v":38},{"$f":"AVERAGE(R20:T20)","v":21},{"$f":"AVERAGE(T20:V20)","v":{"$error":"#DIV/0!"}},{"$f":"AVERAGE(V20:X20)","v":{"$error":"#DIV/0!"}},null,null,{"$f":"L20","v":50},{"$f":"HLOOKUP($AX$8,$M$18:$X$27,3)","v":48},{"$f":"HLOOKUP($AX$9,$M$18:$X$27,3)","v":48},"PRI1:",{"$f":"LARGE(L20:L27,COUNTIF(L20:L27,\">\" &AX6)+1)","v":{"$error":"#NUM!"}},{"$f":"VLOOKUP(AM20,AI20:AK27,2)","v":{"$error":"#NUM!"}},{"$f":"VLOOKUP(AM20,AI20:AK27,3)","v":{"$error":"#NUM!"}},"PRO1:",{"$f":"IF(AX8=AX9, AN20, FORECAST(AX7,$AN$20:$AO$20,$AX$8:$AX$9))","v":{"$error":"#NUM!"}},null,null,"Setting 2",null,{"$f":"IF($AQ$22=$AQ$23,$AQ$22,FORECAST($AX$5,$AQ$22:$AQ$23,$AM$22:$AM$23))","v":{"$error":"#NUM!"}},{"$f":"IF($AQ$20=$AQ$21,$AQ$20,FORECAST($AX$6,$AQ$20:$AQ$21,$AM$20:$AM$21))","v":{"$error":"#NUM!"}},500]
[null,100,89,96,{"$f":"N35","v":100},{"$f":"N49","v":98},{"$f":"N63","v":100},{"$f":"N77","v":97},null,null,null,100,100,96,86,81,76,72,62,49,31,null,null,null,null,null,100,{"$f":"M21","v":100},{"$f":"AVERAGE(N21:R21)","v":82.2},{"$f":"AVERAGE(R21:T21)","v":61},{"$f":"AVERAGE(T21:V21)","v":40},{"$f":"AVERAGE(V21:X21)","v":{"$error":"#DIV/0!"}},null,null,{"$f":"L21","v":100},{"$f":"HLOOKUP($AX$8,$M$18:$X$27,4)","v":100},{"$f":"HLOOKUP($AX$9,$M$18:$X$27,4)","v":100},"PRI2:",{"$f":"SMALL(L20:L27,COUNTIF(L20:L27,\"<\" &AX6)+1)","v":50},{"$f":"VLOOKUP(AM21,AI20:AK27,2)","v":48},{"$f":"VLOOKUP(AM21,AI20:AK27,3)","v":48},"PRO2:",{"$f":"IF(AX8=AX9, AN21, FORECAST(AX7,$AN$21:$AO$21,$AX$8:$AX$9))","v":48},null,null,"Setting 3",null,{"$f":"IF($AQ$36=$AQ$37,$AQ$36,FORECAST($AX$5,$AQ$36:$AQ$37,$AM$36:$AM$37))","v":{"$error":"#NUM!"}},{"$f":"IF($AQ$34=$AQ$35,$AQ$34,FORECAST($AX$6,$AQ$34:$AQ$35,$AM$34:$AM$35))","v":{"$error":"#NUM!"}},500]
[null,150,103,131,{"$f":"N36","v":147},148,149,149,null,null,null,150,140,131,118,114,110,104,98,90,82,61,38,null,null,null,150,140,115.4,97.333333333333329,77.666666666666671,49.5,null,null,150,{"$f":"HLOOKUP($AX$8,$M$18:$X$27,5)","v":140},{"$f":"HLOOKUP($AX$9,$M$18:$X$27,5)","v":140},"PSI1:",{"$f":"LARGE(L20:L27,COUNTIF(L20:L27,\">\" &AX5)+1)","v":{"$error":"#NUM!"}},null,null,"PSO1:",{"$f":"VLOOKUP(AM22,L20:M27,2)","v":{"$error":"#NUM!"}},null,null,"Setting 4",null,{"$f":"IF($AQ$50=$AQ$51,$AQ$50,FORECAST($AX$5,$AQ$50:$AQ$51,$AM$50:$AM$51))","v":{"$error":"#NUM!"}},{"$f":"IF($AQ$48=$AQ$49,$AQ$48,FORECAST($AX$6,$AQ$48:$AQ$49,$AM$48:$AM$49))","v":{"$error":"#NUM!"}},500]
[null,200,123,153,180,197,199,199,null,null,null,200,163,153,147,135,132,129,124,117,110,102,88,65,null,null,200,163,139.19999999999999,123.33333333333333,109.66666666666667,85,null,null,200,{"$f":"HLOOKUP($AX$8,$M$18:$X$27,6)","v":163},{"$f":"HLOOKUP($AX$9,$M$18:$X$27,6)","v":163},"PSI2:",{"$f":"SMALL(L20:L27,COUNTIF(L20:L27,\"<\" &AX5)+1)","v":50},null,null,"PSO2:",{"$f":"VLOOKUP(AM23,L20:M27,2)","v":48},null,null,"Setting 5",null,{"$f":"IF($AQ$64=$AQ$65,$AQ$64,FORECAST($AX$5,$AQ$64:$AQ$65,$AM$64:$AM$65))","v":{"$error":"#NUM!"}},{"$f":"IF($AQ$62=$AQ$63,$AQ$62,FORECAST($AX$6,$AQ$62:$AQ$63,$AM$62:$AM$63))","v":{"$error":"#NUM!"}},500]
[null,250,143,171,205,235,248,248,null,null,null,250,182,171,164,157,155,152,146,140,135,127,120,110,null,null,250,182,159.80000000000001,146,134,119,null,null,250,{"$f":"HLOOKUP($AX$8,$M$18:$X$27,7)","v":182},{"$f":"HLOOKUP($AX$9,$M$18:$X$27,7)","v":182},null,null,null,null,null,null,null,null,"Setting 6",null,{"$f":"IF($AQ$78=$AQ$79,$AQ$78,FORECAST($AX$5,$AQ$78:$AQ$79,$AM$78:$AM$79))","v":{"$error":"#NUM!"}},{"$f":"IF($AQ$76=$AQ$77,$AQ$76,FORECAST($AX$6,$AQ$76:$AQ$77,$AM$76:$AM$77))","v":{"$error":"#NUM!"}},500]
[null,300,167,192,224,254,281,297,null,null,null,300,203,192,186,178,175,173,168,161,155,149,142,134,null,null,300,203,180.8,167.33333333333334,155,141.66666666666666,null,null,300,{"$f":"HLOOKUP($AX$8,$M$18:$X$27,8)","v":203},{"$f":"HLOOKUP($AX$9,$M$18:$X$27,8)","v":203}]
[null,350,185,209,240,265,309,337,null,null,null,350,223,209,202,198,194,194,188,183,176,170,163,157,null,null,350,223,199.4,188.33333333333334,176.33333333333334,163.33333333333334,null,null,350,{"$f":"HLOOKUP($AX$8,$M$18:$X$27,9)","v":223},{"$f":"HLOOKUP($AX$9,$M$18:$X$27,9)","v":223}]
[null,400,208,229,262,287,329,362,null,null,null,400,243,229,223,217,215,214,205,203,196,193,183,175,null,null,400,243,219.6,207.33333333333334,197.33333333333334,183.66666666666666,null,null,400,{"$f":"HLOOKUP($AX$8,$M$18:$X$27,10)","v":243},{"$f":"HLOOKUP($AX$9,$M$18:$X$27,10)","v":243}]
[]
[]
[]
[null,"100 GPM FLOW RATE",null,null,null,null,null,null,null,null,"Bonnet Setting","Inlet Pressure psig","OUTLET PRESSURES @ FLOW RATE, GPM",null,null,null,null,null,null,null,null,null,null,null,null,null,"Setting # 3: Inlet vs. Outlet Pressure Over Flow Range",null,null,null,null,null,null,null,"SETTING 3"]
[null,"Inlet (psig)","Outlet-1 (psig)","Outlet-2 (psig)","Outlet-3 (psig)","Outlet-4 (psig)","Outlet-5 (psig)","Outlet-6 (psig)",null,null,null,null,0,50,100,150,175,200,250,300,350,400,450,500,null,null,"Inlet (psig)","Static","50-200 [GPM]","200-300 [GPM]","300-400 [GPM]","400-500 [GPM]",null,null,"Inlet (psig)",{"$f":"CONCATENATE(\"Outlet Residual @ \" &AX$8& \" GPM\")","v":"Outlet Residual @ 0 GPM"},{"$f":"CONCATENATE(\"Outlet Residual @ \" &AX$9& \" GPM\")","v":"Outlet Residual @ 0 GPM"},null,null,"Const. PRI Interpolated @ Var. Flow"]
[null,0,{"$f":"O5","v":0},{"$f":"O19","v":0},{"$f":"O33","v":0},{"$f":"O47","v":0},{"$f":"O61","v":0},{"$f":"O75","v":0},null,null,3,0,null,null,null,null,null,null,null,null,null,null,null,null,null,null,{"$f":"L33","v":0}]
[null,50,39,{"$f":"O20","v":43},{"$f":"O34","v":46},{"$f":"O48","v":43},{"$f":"O62","v":44},{"$f":"O76","v":42},null,null,null,50,47,47,46,35,31,26,15,null,null,null,null,null,null,null,{"$f":"L34","v":50},{"$f":"M34","v":47},{"$f":"AVERAGE(N34:R34)","v":37},{"$f":"AVERAGE(R34:T34)","v":20.5},{"$f":"AVERAGE(T34:V34)","v":{"$error":"#DIV/0!"}},{"$f":"AVERAGE(V34:X34)","v":{"$error":"#DIV/0!"}},null,null,{"$f":"L34","v":50},{"$f":"HLOOKUP($AX$8,$M$32:$X$41,3)","v":47},{"$f":"HLOOKUP($AX$9,$M$32:$X$41,3)","v":47},"PRI1:",{"$f":"LARGE(L34:L41,COUNTIF(L34:L41,\">\" &AX6)+1)","v":{"$error":"#NUM!"}},{"$f":"VLOOKUP(AM34,AI34:AK41,2)","v":{"$error":"#NUM!"}},{"$f":"VLOOKUP(AM34,AI34:AK41,3)","v":{"$error":"#NUM!"}},"PRO1:",{"$f":"IF(AX8=AX9, AN34, FORECAST(AX7,$AN$34:$AO$34,$AX$8:$AX$9))","v":{"$error":"#NUM!"}}]
[null,100,72,{"$f":"O21","v":86},{"$f":"O35","v":95},{"$f":"O49","v":96},{"$f":"O63","v":92},{"$f":"O77","v":95},null,null,null,100,100,100,95,89,82,78,64,48,31,null,null,null,null,null,100,{"$f":"M35","v":100},{"$f":"AVERAGE(N35:R35)","v":88.8},{"$f":"AVERAGE(R35:T35)","v":63.333333333333336},{"$f":"AVERAGE(T35:V35)","v":39.5},{"$f":"AVERAGE(V35:X35)","v":{"$error":"#DIV/0!"}},null,null,{"$f":"L35","v":100},{"$f":"HLOOKUP($AX$8,$M$32:$X$41,4)","v":100},{"$f":"HLOOKUP($AX$9,$M$32:$X$41,4)","v":100},"PRI2:",{"$f":"SMALL(L34:L41,COUNTIF(L34:L41,\"<\" &AX6)+1)","v":50},{"$f":"VLOOKUP(AM35,AI34:AK41,2)","v":47},{"$f":"VLOOKUP(AM35,AI34:AK41,3)","v":47},"PRO2:",{"$f":"IF(AX8=AX9, AN35, FORECAST(AX7,$AN$35:$AO$35,$AX$8:$AX$9))","v":47}]
[null,150,96,{"$f":"O22","v":118},{"$f":"O36","v":138},145,145,144,null,null,null,150,150,147,138,131,130,126,116,99,81,61,38,null,null,null,150,150,134.4,113.66666666666667,80.333333333333329,49.5,null,null,150,{"$f":"HLOOKUP($AX$8,$M$32:$X$41,5)","v":150},{"$f":"HLOOKUP($AX$9,$M$32:$X$41,5)","v":150},"PSI1:",{"$f":"LARGE(L34:L41,COUNTIF(L34:L41,\">\" &AX5)+1)","v":{"$error":"#NUM!"}},null,null,"PSO1:",{"$f":"VLOOKUP(AM36,L34:M41,2)","v":{"$error":"#NUM!"}}]
[null,200,116,147,170,187,195,194,null,null,null,200,193,180,170,161,159,158,147,142,131,109,88,61,null,null,200,193,165.6,149,127.33333333333333,86,null,null,200,{"$f":"HLOOKUP($AX$8,$M$32:$X$41,6)","v":193},{"$f":"HLOOKUP($AX$9,$M$32:$X$41,6)","v":193},"PSI2:",{"$f":"SMALL(L34:L41,COUNTIF(L34:L41,\"<\" &AX5)+1)","v":50},null,null,"PSO2:",{"$f":"VLOOKUP(AM37,L34:M41,2)","v":47}]
[null,250,136,164,193,217,240,244,null,null,null,250,214,205,193,187,183,180,174,169,160,153,137,112,null,null,250,214,189.6,174.33333333333334,160.66666666666666,134,null,null,250,{"$f":"HLOOKUP($AX$8,$M$32:$X$41,7)","v":214},{"$f":"HLOOKUP($AX$9,$M$32:$X$41,7)","v":214}]
[null,300,157,186,213,247,274,289,null,null,null,300,235,224,213,209,206,203,197,191,185,177,171,160,null,null,300,235,211,197,184.33333333333334,169.33333333333334,null,null,300,{"$f":"HLOOKUP($AX$8,$M$32:$X$41,8)","v":235},{"$f":"HLOOKUP($AX$9,$M$32:$X$41,8)","v":235}]
[null,350,172,202,234,261,301,325,null,null,null,350,254,240,234,229,228,228,220,212,206,198,193,185,null,null,350,254,231.8,220,205.33333333333334,192,null,null,350,{"$f":"HLOOKUP($AX$8,$M$32:$X$41,9)","v":254},{"$f":"HLOOKUP($AX$9,$M$32:$X$41,9)","v":254}]
[null,400,197,223,254,282,318,348,null,null,null,400,273,262,254,247,245,241,238,231,227,221,216,208,null,null,400,273,249.8,236.66666666666666,226.33333333333334,215,null,null,400,{"$f":"HLOOKUP($AX$8,$M$32:$X$41,10)","v":273},{"$f":"HLOOKUP($AX$9,$M$32:$X$41,10)","v":273}]
[]
[]
[]
[null,"150 GPM FLOW RATE",null,null,null,null,null,null,null,null,"Bonnet Setting","Inlet Pressure psig","OUTLET PRESSURES @ FLOW RATE, GPM",null,null,null,null,null,null,null,null,null,null,null,null,null,"Setting # 4: Inlet vs. Outlet Pressure Over Flow Range",null,null,null,null,null,null,null,"SETTING 4"]
[null,"Inlet (psig)","Outlet-1 (psig)","Outlet-2 (psig)","Outlet-3 (psig)","Outlet-4 (psig)","Outlet-5 (psig)","Outlet-6 (psig)",null,null,null,null,0,50,100,150,175,200,250,300,350,400,450,500,null,null,"Inlet (psig)","Static","50-200 [GPM]","200-300 [GPM]","300-400 [GPM]","400-500 [GPM]",null,null,"Inlet (psig)",{"$f":"CONCATENATE(\"Outlet Residual @ \" &AX$8& \" GPM\")","v":"Outlet Residual @ 0 GPM"},{"$f":"CONCATENATE(\"Outlet Residual @ \" &AX$9& \" GPM\")","v":"Outlet Residual @ 0 GPM"},null,null,"Const. PRI Interpolated @ Var. Flow"]
[null,0,{"$f":"P5","v":0},{"$f":"P19","v":0},{"$f":"P33","v":0},{"$f":"P47","v":0},{"$f":"P61","v":0},{"$f":"P75","v":0},null,null,4,0,null,null,null,null,null,null,null,null,null,null,null,null,null,null,{"$f":"L47","v":0}]
[null,50,35,{"$f":"P20","v":37},{"$f":"P34","v":35},{"$f":"P48","v":38},{"$f":"P62","v":39},{"$f":"P76","v":36},null,null,null,50,49,49,43,38,34,27,15,null,null,null,null,null,null,null,{"$f":"L48","v":50},{"$f":"M48","v":49},{"$f":"AVERAGE(N48:R48)","v":38.200000000000003},{"$f":"AVERAGE(R48:T48)","v":21},{"$f":"AVERAGE(T48:V48)","v":{"$error":"#DIV/0!"}},{"$f":"AVERAGE(V48:X48)","v":{"$error":"#DIV/0!"}},null,null,{"$f":"L48","v":50},{"$f":"HLOOKUP($AX$8,$M$46:$X$55,3)","v":49},{"$f":"HLOOKUP($AX$9,$M$46:$X$55,3)","v":49},"PRI1:",{"$f":"LARGE(L48:L55,COUNTIF(L48:L55,\">\" &AX6)+1)","v":{"$error":"#NUM!"}},{"$f":"VLOOKUP(AM48,AI48:AK55,2)","v":{"$error":"#NUM!"}},{"$f":"VLOOKUP(AM48,AI48:AK55,3)","v":{"$error":"#NUM!"}},"PRO1:",{"$f":"IF(AX8=AX9, AN48, FORECAST(AX7,$AN$48:$AO$48,$AX$8:$AX$9))","v":{"$error":"#NUM!"}}]
[null,100,64,{"$f":"P21","v":81},{"$f":"P35","v":89},{"$f":"P49","v":88},{"$f":"P63","v":86},{"$f":"P77","v":88},null,null,null,100,100,98,96,88,82,77,64,50,32,null,null,null,null,null,100,{"$f":"M49","v":100},{"$f":"AVERAGE(N49:R49)","v":88.2},{"$f":"AVERAGE(R49:T49)","v":63.666666666666664},{"$f":"AVERAGE(T49:V49)","v":41},{"$f":"AVERAGE(V49:X49)","v":{"$error":"#DIV/0!"}},null,null,{"$f":"L49","v":100},{"$f":"HLOOKUP($AX$8,$M$46:$X$55,4)","v":100},{"$f":"HLOOKUP($AX$9,$M$46:$X$55,4)","v":100},"PRI2:",{"$f":"SMALL(L48:L55,COUNTIF(L48:L55,\"<\" &AX6)+1)","v":50},{"$f":"VLOOKUP(AM49,AI48:AK55,2)","v":49},{"$f":"VLOOKUP(AM49,AI48:AK55,3)","v":49},"PRO2:",{"$f":"IF(AX8=AX9, AN49, FORECAST(AX7,$AN$49:$AO$49,$AX$8:$AX$9))","v":49}]
[null,150,89,{"$f":"P22","v":114},131,138,138,137,null,null,null,150,150,148,145,138,132,127,114,100,82,61,41,null,null,null,150,150,138,113.66666666666667,81,51,null,null,150,{"$f":"HLOOKUP($AX$8,$M$46:$X$55,5)","v":150},{"$f":"HLOOKUP($AX$9,$M$46:$X$55,5)","v":150},"PSI1:",{"$f":"LARGE(L48:L55,COUNTIF(L48:L55,\">\" &AX5)+1)","v":{"$error":"#NUM!"}},null,null,"PSO1:",{"$f":"VLOOKUP(AM50,L48:M55,2)","v":{"$error":"#NUM!"}}]
[null,200,114,135,161,180,188,184,null,null,null,200,200,197,187,180,176,171,164,147,132,109,88,61,null,null,200,200,182.2,160.66666666666666,129.33333333333334,86,null,null,200,{"$f":"HLOOKUP($AX$8,$M$46:$X$55,6)","v":200},{"$f":"HLOOKUP($AX$9,$M$46:$X$55,6)","v":200},"PSI2:",{"$f":"SMALL(L48:L55,COUNTIF(L48:L55,\"<\" &AX5)+1)","v":50},null,null,"PSO2:",{"$f":"VLOOKUP(AM51,L48:M55,2)","v":49}]
[null,250,132,157,187,212,233,237,null,null,null,250,248,235,217,212,214,205,198,188,180,160,138,111,null,null,250,248,216.6,197,176,136.33333333333334,null,null,250,{"$f":"HLOOKUP($AX$8,$M$46:$X$55,7)","v":248},{"$f":"HLOOKUP($AX$9,$M$46:$X$55,7)","v":248}]
[null,300,150,178,209,237,265,284,null,null,null,300,265,254,247,237,239,234,222,213,207,206,185,164,null,null,300,265,242.2,223,208.66666666666666,185,null,null,300,{"$f":"HLOOKUP($AX$8,$M$46:$X$55,8)","v":265},{"$f":"HLOOKUP($AX$9,$M$46:$X$55,8)","v":265}]
[null,350,170,198,229,259,296,317,null,null,null,350,282,265,261,259,251,262,250,235,232,226,221,210,null,null,350,282,259.60000000000002,249,231,219,null,null,350,{"$f":"HLOOKUP($AX$8,$M$46:$X$55,9)","v":282},{"$f":"HLOOKUP($AX$9,$M$46:$X$55,9)","v":282}]
[null,400,190,217,247,273,315,346,null,null,null,400,305,287,282,273,275,269,276,259,253,251,242,234,null,null,400,305,277.2,268,254.33333333333334,242.33333333333334,null,null,400,{"$f":"HLOOKUP($AX$8,$M$46:$X$55,10)","v":305},{"$f":"HLOOKUP($AX$9,$M$46:$X$55,10)","v":305}]
[]
[]
[]
[null,"175 GPM FLOW RATE",null,null,null,null,null,null,null,null,"Bonnet Setting","Inlet Pressure psig","OUTLET PRESSURES @ FLOW RATE, GPM",null,null,null,null,null,null,null,null,null,null,null,null,null,"Setting # 5: Inlet vs. Outlet Pressure Over Flow Range",null,null,null,null,null,null,null,"SETTING 5"]
[null,"Inlet (psig)","Outlet-1 (psig)","Outlet-2 (psig)","Outlet-3 (psig)","Outlet-4 (psig)","Outlet-5 (psig)","Outlet-6 (psig)",null,null,null,null,0,50,100,150,175,200,250,300,350,400,450,500,null,null,"Inlet (psig)","Static","50-200 [GPM]","200-300 [GPM]","300-400 [GPM]","400-500 [GPM]",null,null,"Inlet (psig)",{"$f":"CONCATENATE(\"Outlet Residual @ \" &AX$8& \" GPM\")","v":"Outlet Residual @ 0 GPM"},{"$f":"CONCATENATE(\"Outlet Residual @ \" &AX$9& \" GPM\")","v":"Outlet Residual @ 0 GPM"},null,null,"Const. PRI Interpolated @ Var. Flow"]
[null,0,{"$f":"Q5","v":0},{"$f":"Q19","v":0},{"$f":"Q33","v":0},{"$f":"Q47","v":0},{"$f":"Q61","v":0},{"$f":"Q75","v":0},null,null,5,0,null,null,null,null,null,null,null,null,null,null,null,null,null,null,{"$f":"L61","v":0}]
[null,50,{"$f":"Q6","v":29},{"$f":"Q20","v":32},{"$f":"Q34","v":31},{"$f":"Q48","v":34},{"$f":"Q62","v":32},{"$f":"Q76","v":32},null,null,null,50,50,50,44,39,32,27,14,null,null,null,null,null,null,null,{"$f":"L62","v":50},{"$f":"M62","v":50},{"$f":"AVERAGE(N62:R62)","v":38.4},{"$f":"AVERAGE(R62:T62)","v":20.5},{"$f":"AVERAGE(T62:V62)","v":{"$error":"#DIV/0!"}},{"$f":"AVERAGE(V62:X62)","v":{"$error":"#DIV/0!"}},null,null,{"$f":"L62","v":50},{"$f":"HLOOKUP($AX$8,$M$60:$X$69,3)","v":50},{"$f":"HLOOKUP($AX$9,$M$60:$X$69,3)","v":50},"PRI1:",{"$f":"LARGE(L62:L69,COUNTIF(L62:L69,\">\" &AX6)+1)","v":{"$error":"#NUM!"}},{"$f":"VLOOKUP(AM62,AI62:AK69,2)","v":{"$error":"#NUM!"}},{"$f":"VLOOKUP(AM62,AI62:AK69,3)","v":{"$error":"#NUM!"}},"PRO1:",{"$f":"IF(AX8=AX9, AN62, FORECAST(AX7,$AN$62:$AO$62,$AX$8:$AX$9))","v":{"$error":"#NUM!"}}]
[null,100,{"$f":"Q7","v":60},{"$f":"Q21","v":76},{"$f":"Q35","v":82},{"$f":"Q49","v":82},{"$f":"Q63","v":82},{"$f":"Q77","v":82},null,null,null,100,100,100,92,86,82,77,66,48,31,null,null,null,null,null,100,{"$f":"M63","v":100},{"$f":"AVERAGE(N63:R63)","v":87.4},{"$f":"AVERAGE(R63:T63)","v":63.666666666666664},{"$f":"AVERAGE(T63:V63)","v":39.5},{"$f":"AVERAGE(V63:X63)","v":{"$error":"#DIV/0!"}},null,null,{"$f":"L63","v":100},{"$f":"HLOOKUP($AX$8,$M$60:$X$69,4)","v":100},{"$f":"HLOOKUP($AX$9,$M$60:$X$69,4)","v":100},"PRI2:",{"$f":"SMALL(L62:L69,COUNTIF(L62:L69,\"<\" &AX6)+1)","v":50},{"$f":"VLOOKUP(AM63,AI62:AK69,2)","v":50},{"$f":"VLOOKUP(AM63,AI62:AK69,3)","v":50},"PRO2:",{"$f":"IF(AX8=AX9, AN63, FORECAST(AX7,$AN$63:$AO$63,$AX$8:$AX$9))","v":50}]
[null,150,{"$f":"Q8","v":88},{"$f":"Q22","v":110},130,132,133,133,null,null,null,150,150,149,145,138,133,126,115,100,83,59,41,null,null,null,150,150,138.19999999999999,113.66666666666667,80.666666666666671,50,null,null,150,{"$f":"HLOOKUP($AX$8,$M$60:$X$69,5)","v":150},{"$f":"HLOOKUP($AX$9,$M$60:$X$69,5)","v":150},"PSI1:",{"$f":"LARGE(L62:L69,COUNTIF(L62:L69,\">\" &AX5)+1)","v":{"$error":"#NUM!"}},null,null,"PSO1:",{"$f":"VLOOKUP(AM64,L62:M69,2)","v":{"$error":"#NUM!"}}]
[null,200,111,132,159,176,184,181,null,null,null,200,200,199,195,188,184,178,164,149,132,111,89,65,null,null,200,200,188.8,163.66666666666666,130.66666666666666,88.333333333333329,null,null,200,{"$f":"HLOOKUP($AX$8,$M$60:$X$69,6)","v":200},{"$f":"HLOOKUP($AX$9,$M$60:$X$69,6)","v":200},"PSI2:",{"$f":"SMALL(L62:L69,COUNTIF(L62:L69,\"<\" &AX5)+1)","v":50},null,null,"PSO2:",{"$f":"VLOOKUP(AM65,L62:M69,2)","v":50}]
[null,250,130,155,183,214,230,232,null,null,null,250,250,248,240,233,230,226,215,201,182,168,139,116,null,null,250,250,235.4,214,183.66666666666666,141,null,null,250,{"$f":"HLOOKUP($AX$8,$M$60:$X$69,7)","v":250},{"$f":"HLOOKUP($AX$9,$M$60:$X$69,7)","v":250}]
[null,300,148,175,206,239,263,277,null,null,null,300,297,281,274,265,263,261,253,245,232,210,188,161,null,null,300,297,268.8,253,229,186.33333333333334,null,null,300,{"$f":"HLOOKUP($AX$8,$M$60:$X$69,8)","v":297},{"$f":"HLOOKUP($AX$9,$M$60:$X$69,8)","v":297}]
[null,350,168,194,228,251,292,312,null,null,null,350,320,309,301,296,292,286,279,271,262,254,237,214,null,null,350,320,296.8,278.66666666666669,262.33333333333331,235,null,null,350,{"$f":"HLOOKUP($AX$8,$M$60:$X$69,9)","v":320},{"$f":"HLOOKUP($AX$9,$M$60:$X$69,9)","v":320}]
[null,400,186,215,245,275,312,340,null,null,null,400,338,329,318,315,312,310,303,293,288,279,274,263,null,null,400,338,316.8,302,286.66666666666669,272,null,null,400,{"$f":"HLOOKUP($AX$8,$M$60:$X$69,10)","v":338},{"$f":"HLOOKUP($AX$9,$M$60:$X$69,10)","v":338}]
[]
[]
[]
[null,"200 GPM FLOW RATE",null,null,null,null,null,null,null,null,"Bonnet Setting","Inlet Pressure psig","OUTLET PRESSURES @ FLOW RATE, GPM",null,null,null,null,null,null,null,null,null,null,null,null,null,"Setting # 6: Inlet vs. Outlet Pressure Over Flow Range",null,null,null,null,null,null,null,"SETTING 6"]
[null,"Inlet (psig)","Outlet-1 (psig)","Outlet-2 (psig)","Outlet-3 (psig)","Outlet-4 (psig)","Outlet-5 (psig)","Outlet-6 (psig)",null,null,null,null,0,50,100,150,175,200,250,300,350,400,450,500,null,null,"Inlet (psig)","Static","50-200 [GPM]","200-300 [GPM]","300-400 [GPM]","400-500 [GPM]",null,null,"Inlet (psig)",{"$f":"CONCATENATE(\"Outlet Residual @ \" &AX$8& \" GPM\")","v":"Outlet Residual @ 0 GPM"},{"$f":"CONCATENATE(\"Outlet Residual @ \" &AX$9& \" GPM\")","v":"Outlet Residual @ 0 GPM"},null,null,"Const. PRI Interpolated @ Var. Flow"]
[null,0,{"$f":"R5","v":0},{"$f":"R19","v":0},{"$f":"R33","v":0},{"$f":"R47","v":0},{"$f":"R61","v":0},{"$f":"R75","v":0},null,null,6,0,null,null,null,null,null,null,null,null,null,null,null,null,null,null,{"$f":"L75","v":0}]
[null,50,28,{"$f":"R20","v":28},{"$f":"R34","v":26},{"$f":"R48","v":27},{"$f":"R62","v":27},{"$f":"R76","v":25},null,null,null,50,50,50,42,36,32,25,15,null,null,null,null,null,null,null,{"$f":"L76","v":50},{"$f":"M76","v":50},{"$f":"AVERAGE(N76:R76)","v":37},{"$f":"AVERAGE(R76:T76)","v":20},{"$f":"AVERAGE(T76:V76)","v":{"$error":"#DIV/0!"}},{"$f":"AVERAGE(V76:X76)","v":{"$error":"#DIV/0!"}},null,null,{"$f":"L76","v":50},{"$f":"HLOOKUP($AX$8,$M$74:$X$83,3)","v":50},{"$f":"HLOOKUP($AX$9,$M$74:$X$83,3)","v":50},"PRI1:",{"$f":"LARGE(L76:L83,COUNTIF(L76:L83,\">\" &AX6)+1)","v":{"$error":"#NUM!"}},{"$f":"VLOOKUP(AM76,AI76:AK83,2)","v":{"$error":"#NUM!"}},{"$f":"VLOOKUP(AM76,AI76:AK83,3)","v":{"$error":"#NUM!"}},"PRO1:",{"$f":"IF(AX8=AX9, AN76, FORECAST(AX7,$AN$76:$AO$76,$AX$8:$AX$9))","v":{"$error":"#NUM!"}}]
[null,100,59,{"$f":"R21","v":72},{"$f":"R35","v":78},{"$f":"R49","v":77},{"$f":"R63","v":77},{"$f":"R77","v":78},null,null,null,100,100,97,95,88,82,78,63,49,32,null,null,null,null,null,100,{"$f":"M77","v":100},{"$f":"AVERAGE(N77:R77)","v":88},{"$f":"AVERAGE(R77:T77)","v":63.333333333333336},{"$f":"AVERAGE(T77:V77)","v":40.5},{"$f":"AVERAGE(V77:X77)","v":{"$error":"#DIV/0!"}},null,null,{"$f":"L77","v":100},{"$f":"HLOOKUP($AX$8,$M$74:$X$83,4)","v":100},{"$f":"HLOOKUP($AX$9,$M$74:$X$83,4)","v":100},"PRI2:",{"$f":"SMALL(L76:L83,COUNTIF(L76:L83,\"<\" &AX6)+1)","v":50},{"$f":"VLOOKUP(AM77,AI76:AK83,2)","v":50},{"$f":"VLOOKUP(AM77,AI76:AK83,3)","v":50},"PRO2:",{"$f":"IF(AX8=AX9, AN77, FORECAST(AX7,$AN$77:$AO$77,$AX$8:$AX$9))","v":50}]
[null,150,85,{"$f":"R22","v":104},126,127,126,126,null,null,null,150,150,149,144,137,133,126,114,99,80,59,39,null,null,null,150,150,137.80000000000001,113,79.333333333333329,49,null,null,150,{"$f":"HLOOKUP($AX$8,$M$74:$X$83,5)","v":150},{"$f":"HLOOKUP($AX$9,$M$74:$X$83,5)","v":150},"PSI1:",{"$f":"LARGE(L76:L83,COUNTIF(L76:L83,\">\" &AX5)+1)","v":{"$error":"#NUM!"}},null,null,"PSO1:",{"$f":"VLOOKUP(AM78,L76:M83,2)","v":{"$error":"#NUM!"}}]
[null,200,109,129,158,171,178,178,null,null,null,200,200,199,194,184,181,178,165,149,134,111,90,63,null,null,200,200,187.2,164,131.33333333333334,88,null,null,200,{"$f":"HLOOKUP($AX$8,$M$74:$X$83,6)","v":200},{"$f":"HLOOKUP($AX$9,$M$74:$X$83,6)","v":200},"PSI2:",{"$f":"SMALL(L76:L83,COUNTIF(L76:L83,\"<\" &AX5)+1)","v":50},null,null,"PSO2:",{"$f":"VLOOKUP(AM79,L76:M83,2)","v":50}]
[null,250,127,152,180,205,226,226,null,null,null,250,250,248,244,237,232,226,213,199,180,160,138,116,null,null,250,250,237.4,212.66666666666666,179.66666666666666,138,null,null,250,{"$f":"HLOOKUP($AX$8,$M$74:$X$83,7)","v":250},{"$f":"HLOOKUP($AX$9,$M$74:$X$83,7)","v":250}]
[null,300,146,173,203,234,261,275,null,null,null,300,300,297,289,284,277,275,261,248,232,210,189,164,null,null,300,300,284.39999999999998,261.33333333333331,230,187.66666666666666,null,null,300,{"$f":"HLOOKUP($AX$8,$M$74:$X$83,8)","v":300},{"$f":"HLOOKUP($AX$9,$M$74:$X$83,8)","v":300}]
[null,350,164,194,228,262,286,310,null,null,null,350,348,337,325,317,312,310,299,290,281,261,238,213,null,null,350,348,320.2,299.66666666666669,277.33333333333331,237.33333333333334,null,null,350,{"$f":"HLOOKUP($AX$8,$M$74:$X$83,9)","v":348},{"$f":"HLOOKUP($AX$9,$M$74:$X$83,9)","v":348}]
[null,400,186,214,241,269,310,337,null,null,null,400,368,362,348,346,340,337,331,321,311,306,287,260,null,null,400,368,346.6,329.66666666666669,312.66666666666669,284.33333333333331,null,null,400,{"$f":"HLOOKUP($AX$8,$M$74:$X$83,10)","v":368},{"$f":"HLOOKUP($AX$9,$M$74:$X$83,10)","v":368}]
[]
[]
[]
[null,"250 GPM FLOW RATE"]
[null,"Inlet (psig)","Outlet-1 (psig)","Outlet-2 (psig)","Outlet-3 (psig)","Outlet-4 (psig)","Outlet-5 (psig)","Outlet-6 (psig)"]
[null,0,{"$f":"S5","v":0},{"$f":"S19","v":0},{"$f":"S33","v":0},{"$f":"S47","v":0},{"$f":"S61","v":0},{"$f":"S75","v":0}]
[null,50,{"$f":"S6","v":15},{"$f":"S20","v":14},{"$f":"S34","v":15},{"$f":"S48","v":15},{"$f":"S62","v":14},{"$f":"S76","v":15}]
[null,100,{"$f":"S7","v":51},{"$f":"S21","v":62},{"$f":"S35","v":64},{"$f":"S49","v":64},{"$f":"S63","v":66},{"$f":"S77","v":63}]
[null,150,{"$f":"S8","v":77},{"$f":"S22","v":98},116,114,115,114]
[null,200,100,124,147,164,164,165]
[null,250,122,146,174,198,215,213]
[null,300,142,168,197,222,253,261]
[null,350,161,188,220,250,279,299]
[null,400,178,205,238,276,303,331]
[]
[]
[]
[null,"300 GPM FLOW RATE"]
[null,"Inlet (psig)","Outlet-1 (psig)","Outlet-2 (psig)","Outlet-3 (psig)","Outlet-4 (psig)","Outlet-5 (psig)","Outlet-6 (psig)"]
[null,0,{"$f":"T5","v":0},{"$f":"T19","v":0},{"$f":"T33","v":0},{"$f":"T47","v":0},{"$f":"T61","v":0},{"$f":"T75","v":0}]
[null,50,0,0,{"$f":"T34","v":0},{"$f":"T48","v":0},{"$f":"T62","v":0},{"$f":"T76","v":0}]
[null,100,44,49,{"$f":"T35","v":48},{"$f":"T49","v":50},{"$f":"T63","v":48},{"$f":"T77","v":49}]
[null,150,70,90,{"$f":"T36","v":99},{"$f":"T50","v":100},{"$f":"T64","v":100},{"$f":"T78","v":99}]
[null,200,94,117,142,147,149,149]
[null,250,116,140,169,188,201,199]
[null,300,136,161,191,213,245,248]
[null,350,155,183,212,235,271,290]
[null,400,176,203,231,259,293,321]
[]
[]
[]
[null,"350 GPM FLOW RATE"]
[null,"Inlet (psig)","Outlet-1 (psig)","Outlet-2 (psig)","Outlet-3 (psig)","Outlet-4 (psig)","Outlet-5 (psig)","Outlet-6 (psig)"]
[null,0,{"$f":"U5","v":0},{"$f":"U19","v":0},{"$f":"U33","v":0},{"$f":"U47","v":0},{"$f":"U61","v":0},{"$f":"U75","v":0}]
[null,50,0,0,{"$f":"U34","v":0},{"$f":"U48","v":0},{"$f":"U62","v":0},{"$f":"U76","v":0}]
[null,100,31,31,{"$f":"U35","v":31},{"$f":"U49","v":32},{"$f":"U63","v":31},{"$f":"U77","v":32}]
[null,150,62,82,{"$f":"U36","v":81},{"$f":"U50","v":82},{"$f":"U64","v":83},{"$f":"U78","v":80}]
[null,200,89,110,131,132,132,134]
[null,250,111,135,160,180,182,180]
[null,300,130,155,185,207,232,232]
[null,350,150,176,206,232,262,281]
[null,400,170,196,227,253,288,311]
[]
[]
[]
[null,"400 GPM FLOW RATE"]
[null,"Inlet (psig)","Outlet-1 (psig)","Outlet-2 (psig)","Outlet-3 (psig)","Outlet-4 (psig)","Outlet-5 (psig)","Outlet-6 (psig)"]
[null,0,{"$f":"V5","v":0},{"$f":"V19","v":0},{"$f":"V33","v":0},{"$f":"V47","v":0},{"$f":"V61","v":0},{"$f":"V75","v":0}]
[null,50,0,0,0,0,0,0]
[null,100,0,0,0,0,0,0]
[null,150,56,61,61,61,59,59]
[null,200,81,102,109,109,111,111]
[null,250,103,127,153,160,168,160]
[null,300,125,149,177,206,210,210]
[null,350,144,170,198,226,254,261]
[null,400,164,193,221,251,279,306]
[]
[]
[]
[null,"450 GPM FLOW RATE"]
[null,"Inlet (psig)","Outlet-1 (psig)","Outlet-2 (psig)","Outlet-3 (psig)","Outlet-4 (psig)","Outlet-5 (psig)","Outlet-6 (psig)"]
[null,0,{"$f":"W5","v":0},{"$f":"W19","v":0},{"$f":"W33","v":0},{"$f":"W47","v":0},{"$f":"W61","v":0},{"$f":"W75","v":0}]
[null,50,0,0,0,0,0,0]
[null,100,0,0,0,0,0,0]
[null,150,39,38,38,41,41,39]
[null,200,73,88,88,88,89,90]
[null,250,97,120,137,138,139,138]
[null,300,118,142,171,185,188,189]
[null,350,138,163,193,221,237,238]
[null,400,157,183,216,242,274,287]
[]
[]
[]
[null,"500 GPM FLOW RATE"]
[null,"Inlet (psig)","Outlet-1 (psig)","Outlet-2 (psig)","Outlet-3 (psig)","Outlet-4 (psig)","Outlet-5 (psig)","Outlet-6 (psig)"]
[null,0,{"$f":"X5","v":0},{"$f":"X19","v":0},{"$f":"X33","v":0},{"$f":"X47","v":0},{"$f":"X61","v":0},{"$f":"X75","v":0}]
[null,50,0,0,0,0,0,0]
[null,100,0,0,0,0,0,0]
[null,150,0,0,0,0,0,0]
[null,200,63,65,61,61,65,63]
[null,250,90,110,112,111,116,116]
[null,300,111,134,160,164,161,164]
[null,350,131,157,185,210,214,213]
[null,400,152,175,208,234,263,260]

{"sheet":"IE2600A-250OS-A","index":4,"n_rows":167,"n_cols":50,"rows_kept":167,"cut":false,"hidden":true,"merged":[[156,1,156,7],[72,34,72,42],[73,34,74,34],[73,35,74,35],[73,36,74,36],[73,39,74,40],[74,10,82,10],[72,26,72,31],[86,1,86,7],[100,1,100,7],[114,1,114,7],[128,1,128,7],[142,1,142,7],[60,10,68,10],[72,1,72,7],[72,10,73,10],[72,11,73,11],[72,12,72,23],[58,1,58,7],[58,10,59,10],[58,11,59,11],[58,12,58,23],[58,26,58,31],[58,34,58,42],[59,34,60,34],[59,35,60,35],[59,36,60,36],[59,39,60,40],[44,34,44,42],[45,34,46,34],[45,35,46,35],[45,36,46,36],[45,39,46,40],[46,10,54,10],[32,10,40,10],[44,1,44,7],[44,10,45,10],[44,11,45,11],[44,12,44,23],[44,26,44,31],[30,1,30,7],[30,10,31,10],[30,11,31,11],[30,12,30,23],[30,26,30,31],[30,34,30,42],[31,34,32,34],[31,35,32,35],[31,36,32,36],[31,39,32,40],[18,10,26,10],[18,45,18,46],[19,45,19,46],[20,45,20,46],[21,45,21,46],[22,45,22,46],[23,45,23,46],[16,1,16,7],[16,10,17,10],[16,11,17,11],[16,12,16,23],[16,26,16,31],[7,45,7,47],[8,45,8,47],[16,34,16,42],[17,34,18,34],[17,35,18,35],[17,36,18,36],[17,39,18,40],[17,45,17,46],[3,45,3,49],[0,0,0,23],[2,1,2,7],[2,10,3,10],[2,11,3,11],[2,12,2,23],[2,26,2,31],[2,34,2,42],[3,34,4,34],[3,35,4,35],[3,36,4,36],[3,39,4,40],[4,10,12,10],[4,45,4,47],[5,45,5,47],[6,45,6,47]]}
["Data from Project# 4788271148, Date: 2018-06-05"]
[]
[null,"STATIC FLOW",null,null,null,null,null,null,null,null,"Bonnet Setting","Inlet Pressure psig","OUTLET PRESSURES @ FLOW RATE, GPM",null,null,null,null,null,null,null,null,null,null,null,null,null,"Setting # 1: Inlet vs. Outlet Pressure Over Flow Range",null,null,null,null,null,null,null,"SETTING 1"]
[null,"Inlet (psig)","Outlet-1 (psig)","Outlet-2 (psig)","Outlet-3 (psig)","Outlet-4 (psig)","Outlet-5 (psig)","Outlet-6 (psig)",null,null,null,null,0,50,100,150,175,200,250,300,350,400,450,500,null,null,"Inlet (psig)","Static","50-200 [GPM]","200-300 [GPM]","300-400 [GPM]","400-500 [GPM]",null,null,"Inlet (psig)",{"$f":"CONCATENATE(\"Outlet Residual @ \" &AX$8& \" GPM\")","v":"Outlet Residual @ 0 GPM"},{"$f":"CONCATENATE(\"Outlet Residual @ \" &AX$9& \" GPM\")","v":"Outlet Residual @ 0 GPM"},null,null,"Const. PRI Interpolated @ Var. Flow",null,null,null,null,null,"VARIABLES"]
[null,0,{"$f":"M5","v":0},{"$f":"M19","v":0},{"$f":"M33","v":0},{"$f":"M47","v":0},{"$f":"M61","v":0},{"$f":"M75","v":0},null,null,1,0,null,null,null,null,null,null,null,null,null,null,null,null,null,null,{"$f":"L5","v":0},null,null,null,null,null,null,null,null,null,null,null,null,null,null,null,null,null,null,"Static Inlet Pressure",null,null,"PSI:",{"$f":"Database!$E$2","v":0}]
[null,50,50,50,50,{"$f":"M48","v":50},{"$f":"M62","v":50},{"$f":"M76","v":50},null,null,null,50,50,41,31,27,23,20,14,null,null,null,null,null,null,null,{"$f":"L6","v":50},{"$f":"M6","v":50},{"$f":"AVERAGE(N6:R6)","v":28.4},{"$f":"AVERAGE(R6:T6)","v":17},{"$f":"AVERAGE(T6:V6)","v":{"$error":"#DIV/0!"}},{"$f":"AVERAGE(V6:X6)","v":{"$error":"#DIV/0!"}},null,null,{"$f":"L6","v":50},{"$f":"HLOOKUP($AX$8,$M$4:$X$13,3)","v":50},{"$f":"HLOOKUP($AX$9,$M$4:$X$13,3)","v":50},"PRI1:",{"$f":"LARGE(L6:L13,COUNTIF(L6:L13,\">\" &AX6)+1)","v":{"$error":"#NUM!"}},{"$f":"VLOOKUP(AM6,AI6:AK13,2)","v":{"$error":"#NUM!"}},{"$f":"VLOOKUP(AM6,AI6:AK13,3)","v":{"$error":"#NUM!"}},"PRO1:",{"$f":"IF(AX8=AX9, AN6, FORECAST(AX7,$AN$6:$AO$6,$AX$8:$AX$9))","v":{"$error":"#NUM!"}},null,null,"Residual Inlet Pressure",null,null,"PRI:",{"$f":"Database!$E$3","v":0}]
[null,100,70,90,100,{"$f":"M49","v":100},{"$f":"M63","v":100},{"$f":"M77","v":100},null,null,null,100,70,64,57,52,47,46,42,36,31,null,null,null,null,null,100,70,{"$f":"AVERAGE(N7:R7)","v":53.2},{"$f":"AVERAGE(R7:T7)","v":41.333333333333336},{"$f":"AVERAGE(T7:V7)","v":33.5},{"$f":"AVERAGE(V7:X7)","v":{"$error":"#DIV/0!"}},null,null,{"$f":"L7","v":100},{"$f":"HLOOKUP($AX$8,$M$4:$X$13,4)","v":70},{"$f":"HLOOKUP($AX$9,$M$4:$X$13,4)","v":70},"PRI2:",{"$f":"SMALL(L6:L13,COUNTIF(L6:L13,\"<\" &AX6)+1)","v":50},{"$f":"VLOOKUP(AM7,AI6:AK13,2)","v":50},{"$f":"VLOOKUP(AM7,AI6:AK13,3)","v":50},"PRO2:",{"$f":"IF(AX8=AX9, AN7, FORECAST(AX7,$AN$7:$AO$7,$AX$8:$AX$9))","v":50},null,null,"Flow Rate",null,null,"Q0:",{"$f":"IF(Database!$E$4=500,499.99,Database!$E$4)","v":0}]
[null,150,90,109,130,150,150,150,null,null,null,150,90,85,76,73,71,69,64,60,54,49,41,null,null,null,150,90,74.8,64.333333333333329,54.333333333333336,45,null,null,150,{"$f":"HLOOKUP($AX$8,$M$4:$X$13,5)","v":90},{"$f":"HLOOKUP($AX$9,$M$4:$X$13,5)","v":90},"PSI1:",{"$f":"LARGE(L6:L13,COUNTIF(L6:L13,\">\" &AX5)+1)","v":{"$error":"#NUM!"}},null,null,"PSO1:",{"$f":"VLOOKUP(AM8,L6:M13,2)","v":{"$error":"#NUM!"}},null,null,"Nearest known Flow Rate, 1",null,null,"Q1:",{"$f":"LARGE(M4:X4,COUNTIF(M4:X4,\">\" &AX7)+1)","v":0}]
[null,200,112,130,148,173,199,200,null,null,null,200,112,101,96,92,92,90,85,81,76,71,65,60,null,null,200,112,94.2,85.333333333333329,76,65.333333333333329,null,null,200,{"$f":"HLOOKUP($AX$8,$M$4:$X$13,6)","v":112},{"$f":"HLOOKUP($AX$9,$M$4:$X$13,6)","v":112},"PSI2:",{"$f":"SMALL(L6:L13,COUNTIF(L6:L13,\"<\" &AX5)+1)","v":50},null,null,"PSO2:",{"$f":"VLOOKUP(AM9,L6:M13,2)","v":50},null,null,"Nearest known Flow Rate, 2",null,null,"Q2:",{"$f":"SMALL(M4:X4,COUNTIF(M4:X4,\"<\" &AX7)+1)","v":0}]
[null,250,131,150,170,192,220,238,null,null,null,250,131,121,116,111,108,111,105,101,96,91,85,81,null,null,250,131,113.4,105.66666666666667,96,85.666666666666671,null,null,250,{"$f":"HLOOKUP($AX$8,$M$4:$X$13,7)","v":131},{"$f":"HLOOKUP($AX$9,$M$4:$X$13,7)","v":131}]
[null,300,150,173,191,212,240,261,null,null,null,300,150,145,136,130,128,126,120,120,116,109,105,99,null,null,300,150,133,122,115,104.33333333333333,null,null,300,{"$f":"HLOOKUP($AX$8,$M$4:$X$13,8)","v":150},{"$f":"HLOOKUP($AX$9,$M$4:$X$13,8)","v":150}]
[null,350,172,191,209,225,256,266,null,null,null,350,172,162,156,151,149,147,142,134,133,128,125,120,null,null,350,172,153,141,131.66666666666666,124.33333333333333,null,null,350,{"$f":"HLOOKUP($AX$8,$M$4:$X$13,9)","v":172},{"$f":"HLOOKUP($AX$9,$M$4:$X$13,9)","v":172}]
[null,400,191,215,233,255,278,298,null,null,null,400,191,184,177,172,169,167,162,154,149,151,148,144,null,null,400,191,173.8,161,151.33333333333334,147.66666666666666,null,null,400,{"$f":"HLOOKUP($AX$8,$M$4:$X$13,10)","v":191},{"$f":"HLOOKUP($AX$9,$M$4:$X$13,10)","v":191}]
[]
[]
[]
[null,"50 GPM FLOW RATE",null,null,null,null,null,null,null,null,"Bonnet Setting","Inlet Pressure psig","OUTLET PRESSURES @ FLOW RATE, GPM",null,null,null,null,null,null,null,null,null,null,null,null,null,"Setting # 2: Inlet vs. Outlet Pressure Over Flow Range",null,null,null,null,null,null,null,"SETTING 2"]
[null,"Inlet (psig)","Outlet-1 (psig)","Outlet-2 (psig)","Outlet-3 (psig)","Outlet-4 (psig)","Outlet-5 (psig)","Outlet-6 (psig)",null,null,null,null,0,50,100,150,175,200,250,300,350,400,450,500,null,null,"Inlet (psig)","Static","50-200 [GPM]","200-300 [GPM]","300-400 [GPM]","400-500 [GPM]",null,null,"Inlet (psig)",{"$f":"CONCATENATE(\"Outlet Residual @ \" &AX$8& \" GPM\")","v":"Outlet Residual @ 0 GPM"},{"$f":"CONCATENATE(\"Outlet Residual @ \" &AX$9& \" GPM\")","v":"Outlet Residual @ 0 GPM"},null,null,"Const. PRI Interpolated @ Var. Flow",null,null,null,null,null,"2.5\" Angle Double Spring",null,"Calculated Static Outlet Pressure","Calculated Residual Outlet Pressure","Max Flow Rate"]
[null,0,{"$f":"N5","v":0},{"$f":"N19","v":0},{"$f":"N33","v":0},{"$f":"N47","v":0},{"$f":"N61","v":0},{"$f":"N75","v":0},null,null,2,0,null,null,null,null,null,null,null,null,null,null,null,null,null,null,{"$f":"L19","v":0},null,null,null,null,null,null,null,null,null,null,null,null,null,null,null,null,null,null,"Setting 1",null,{"$f":"IF($AQ$8=$AQ$9,$AQ$8,FORECAST($AX$5,$AQ$8:$AQ$9,$AM$8:$AM$9))","v":{"$error":"#NUM!"}},{"$f":"IF($AQ$6=$AQ$7,$AQ$6,FORECAST($AX$6,$AQ$6:$AQ$7,$AM$6:$AM$7))","v":{"$error":"#NUM!"}},500]
[null,50,41,48,{"$f":"N34","v":48},{"$f":"N48","v":48},{"$f":"N62","v":48},{"$f":"N76","v":49},null,null,null,50,50,48,43,36,32,26,15,null,null,null,null,null,null,null,{"$f":"L20","v":50},{"$f":"M20","v":50},{"$f":"AVERAGE(N20:R20)","v":37},{"$f":"AVERAGE(R20:T20)","v":20.5},{"$f":"AVERAGE(T20:V20)","v":{"$error":"#DIV/0!"}},{"$f":"AVERAGE(V20:X20)","v":{"$error":"#DIV/0!"}},null,null,{"$f":"L20","v":50},{"$f":"HLOOKUP($AX$8,$M$18:$X$27,3)","v":50},{"$f":"HLOOKUP($AX$9,$M$18:$X$27,3)","v":50},"PRI1:",{"$f":"LARGE(L20:L27,COUNTIF(L20:L27,\">\" &AX6)+1)","v":{"$error":"#NUM!"}},{"$f":"VLOOKUP(AM20,AI20:AK27,2)","v":{"$error":"#NUM!"}},{"$f":"VLOOKUP(AM20,AI20:AK27,3)","v":{"$error":"#NUM!"}},"PRO1:",{"$f":"IF(AX8=AX9, AN20, FORECAST(AX7,$AN$20:$AO$20,$AX$8:$AX$9))","v":{"$error":"#NUM!"}},null,null,"Setting 2",null,{"$f":"IF($AQ$22=$AQ$23,$AQ$22,FORECAST($AX$5,$AQ$22:$AQ$23,$AM$22:$AM$23))","v":{"$error":"#NUM!"}},{"$f":"IF($AQ$20=$AQ$21,$AQ$20,FORECAST($AX$6,$AQ$20:$AQ$21,$AM$20:$AM$21))","v":{"$error":"#NUM!"}},500]
[null,100,64,86,{"$f":"N35","v":96},{"$f":"N49","v":99},{"$f":"N63","v":100},{"$f":"N77","v":99},null,null,null,100,90,86,73,67,64,62,56,30,null,null,null,null,null,null,100,90,{"$f":"AVERAGE(N21:R21)","v":70.400000000000006},{"$f":"AVERAGE(R21:T21)","v":49.333333333333336},{"$f":"AVERAGE(T21:V21)","v":30},{"$f":"AVERAGE(V21:X21)","v":{"$error":"#DIV/0!"}},null,null,{"$f":"L21","v":100},{"$f":"HLOOKUP($AX$8,$M$18:$X$27,4)","v":90},{"$f":"HLOOKUP($AX$9,$M$18:$X$27,4)","v":90},"PRI2:",{"$f":"SMALL(L20:L27,COUNTIF(L20:L27,\"<\" &AX6)+1)","v":50},{"$f":"VLOOKUP(AM21,AI20:AK27,2)","v":50},{"$f":"VLOOKUP(AM21,AI20:AK27,3)","v":50},"PRO2:",{"$f":"IF(AX8=AX9, AN21, FORECAST(AX7,$AN$21:$AO$21,$AX$8:$AX$9))","v":50},null,null,"Setting 3",null,{"$f":"IF($AQ$36=$AQ$37,$AQ$36,FORECAST($AX$5,$AQ$36:$AQ$37,$AM$36:$AM$37))","v":{"$error":"#NUM!"}},{"$f":"IF($AQ$34=$AQ$35,$AQ$34,FORECAST($AX$6,$AQ$34:$AQ$35,$AM$34:$AM$35))","v":{"$error":"#NUM!"}},500]
[null,150,85,101,{"$f":"N36","v":127},144,149,149,null,null,null,150,109,101,96,91,88,87,86,77,74,61,38,null,null,null,150,109,92.6,83.333333333333329,70.666666666666671,49.5,null,null,150,{"$f":"HLOOKUP($AX$8,$M$18:$X$27,5)","v":109},{"$f":"HLOOKUP($AX$9,$M$18:$X$27,5)","v":109},"PSI1:",{"$f":"LARGE(L20:L27,COUNTIF(L20:L27,\">\" &AX5)+1)","v":{"$error":"#NUM!"}},null,null,"PSO1:",{"$f":"VLOOKUP(AM22,L20:M27,2)","v":{"$error":"#NUM!"}},null,null,"Setting 4",null,{"$f":"IF($AQ$50=$AQ$51,$AQ$50,FORECAST($AX$5,$AQ$50:$AQ$51,$AM$50:$AM$51))","v":{"$error":"#NUM!"}},{"$f":"IF($AQ$48=$AQ$49,$AQ$48,FORECAST($AX$6,$AQ$48:$AQ$49,$AM$48:$AM$49))","v":{"$error":"#NUM!"}},500]
[null,200,101,122,141,169,190,199,null,null,null,200,130,122,115,118,110,113,104,101,93,88,83,64,null,null,200,130,115.6,106,94,78.333333333333329,null,null,200,{"$f":"HLOOKUP($AX$8,$M$18:$X$27,6)","v":130},{"$f":"HLOOKUP($AX$9,$M$18:$X$27,6)","v":130},"PSI2:",{"$f":"SMALL(L20:L27,COUNTIF(L20:L27,\"<\" &AX5)+1)","v":50},null,null,"PSO2:",{"$f":"VLOOKUP(AM23,L20:M27,2)","v":50},null,null,"Setting 5",null,{"$f":"IF($AQ$64=$AQ$65,$AQ$64,FORECAST($AX$5,$AQ$64:$AQ$65,$AM$64:$AM$65))","v":{"$error":"#NUM!"}},{"$f":"IF($AQ$62=$AQ$63,$AQ$62,FORECAST($AX$6,$AQ$62:$AQ$63,$AM$62:$AM$63))","v":{"$error":"#NUM!"}},500]
[null,250,121,146,157,185,202,228,null,null,null,250,150,146,134,131,134,130,126,120,114,109,105,98,null,null,250,150,135,125.33333333333333,114.33333333333333,104,null,null,250,{"$f":"HLOOKUP($AX$8,$M$18:$X$27,7)","v":150},{"$f":"HLOOKUP($AX$9,$M$18:$X$27,7)","v":150},null,null,null,null,null,null,null,null,"Setting 6",null,{"$f":"IF($AQ$78=$AQ$79,$AQ$78,FORECAST($AX$5,$AQ$78:$AQ$79,$AM$78:$AM$79))","v":{"$error":"#NUM!"}},{"$f":"IF($AQ$76=$AQ$77,$AQ$76,FORECAST($AX$6,$AQ$76:$AQ$77,$AM$76:$AM$77))","v":{"$error":"#NUM!"}},500]
[null,300,145,160,187,202,208,222,null,null,null,300,173,160,152,150,148,146,143,139,135,130,124,120,null,null,300,173,151.19999999999999,142.66666666666666,134.66666666666666,124.66666666666667,null,null,300,{"$f":"HLOOKUP($AX$8,$M$18:$X$27,8)","v":173},{"$f":"HLOOKUP($AX$9,$M$18:$X$27,8)","v":173}]
[null,350,162,185,204,212,227,241,null,null,null,350,191,185,174,170,168,164,159,159,154,148,143,138,null,null,350,191,172.2,160.66666666666666,153.66666666666666,143,null,null,350,{"$f":"HLOOKUP($AX$8,$M$18:$X$27,9)","v":191},{"$f":"HLOOKUP($AX$9,$M$18:$X$27,9)","v":191}]
[null,400,184,201,218,248,247,264,null,null,null,400,215,201,197,191,188,185,179,173,167,170,165,159,null,null,400,215,192.4,179,170,164.66666666666666,null,null,400,{"$f":"HLOOKUP($AX$8,$M$18:$X$27,10)","v":215},{"$f":"HLOOKUP($AX$9,$M$18:$X$27,10)","v":215}]
[]
[]
[]
[null,"100 GPM FLOW RATE",null,null,null,null,null,null,null,null,"Bonnet Setting","Inlet Pressure psig","OUTLET PRESSURES @ FLOW RATE, GPM",null,null,null,null,null,null,null,null,null,null,null,null,null,"Setting # 3: Inlet vs. Outlet Pressure Over Flow Range",null,null,null,null,null,null,null,"SETTING 3"]
[null,"Inlet (psig)","Outlet-1 (psig)","Outlet-2 (psig)","Outlet-3 (psig)","Outlet-4 (psig)","Outlet-5 (psig)","Outlet-6 (psig)",null,null,null,null,0,50,100,150,175,200,250,300,350,400,450,500,null,null,"Inlet (psig)","Static","50-200 [GPM]","200-300 [GPM]","300-400 [GPM]","400-500 [GPM]",null,null,"Inlet (psig)",{"$f":"CONCATENATE(\"Outlet Residual @ \" &AX$8& \" GPM\")","v":"Outlet Residual @ 0 GPM"},{"$f":"CONCATENATE(\"Outlet Residual @ \" &AX$9& \" GPM\")","v":"Outlet Residual @ 0 GPM"},null,null,"Const. PRI Interpolated @ Var. Flow"]
[null,0,{"$f":"O5","v":0},{"$f":"O19","v":0},{"$f":"O33","v":0},{"$f":"O47","v":0},{"$f":"O61","v":0},{"$f":"O75","v":0},null,null,3,0,null,null,null,null,null,null,null,null,null,null,null,null,null,null,{"$f":"L33","v":0}]
[null,50,31,{"$f":"O20","v":43},{"$f":"O34","v":44},{"$f":"O48","v":44},{"$f":"O62","v":44},{"$f":"O76","v":43},null,null,null,50,50,48,44,37,32,27,14,null,null,null,null,null,null,null,{"$f":"L34","v":50},{"$f":"M34","v":50},{"$f":"AVERAGE(N34:R34)","v":37.6},{"$f":"AVERAGE(R34:T34)","v":20.5},{"$f":"AVERAGE(T34:V34)","v":{"$error":"#DIV/0!"}},{"$f":"AVERAGE(V34:X34)","v":{"$error":"#DIV/0!"}},null,null,{"$f":"L34","v":50},{"$f":"HLOOKUP($AX$8,$M$32:$X$41,3)","v":50},{"$f":"HLOOKUP($AX$9,$M$32:$X$41,3)","v":50},"PRI1:",{"$f":"LARGE(L34:L41,COUNTIF(L34:L41,\">\" &AX6)+1)","v":{"$error":"#NUM!"}},{"$f":"VLOOKUP(AM34,AI34:AK41,2)","v":{"$error":"#NUM!"}},{"$f":"VLOOKUP(AM34,AI34:AK41,3)","v":{"$error":"#NUM!"}},"PRO1:",{"$f":"IF(AX8=AX9, AN34, FORECAST(AX7,$AN$34:$AO$34,$AX$8:$AX$9))","v":{"$error":"#NUM!"}}]
[null,100,57,{"$f":"O21","v":73},{"$f":"O35","v":88},{"$f":"O49","v":94},{"$f":"O63","v":94},{"$f":"O77","v":94},null,null,null,100,100,96,88,79,77,73,64,49,31,null,null,null,null,null,100,100,{"$f":"AVERAGE(N35:R35)","v":82.6},{"$f":"AVERAGE(R35:T35)","v":62},{"$f":"AVERAGE(T35:V35)","v":40},{"$f":"AVERAGE(V35:X35)","v":{"$error":"#DIV/0!"}},null,null,{"$f":"L35","v":100},{"$f":"HLOOKUP($AX$8,$M$32:$X$41,4)","v":100},{"$f":"HLOOKUP($AX$9,$M$32:$X$41,4)","v":100},"PRI2:",{"$f":"SMALL(L34:L41,COUNTIF(L34:L41,\"<\" &AX6)+1)","v":50},{"$f":"VLOOKUP(AM35,AI34:AK41,2)","v":50},{"$f":"VLOOKUP(AM35,AI34:AK41,3)","v":50},"PRO2:",{"$f":"IF(AX8=AX9, AN35, FORECAST(AX7,$AN$35:$AO$35,$AX$8:$AX$9))","v":50}]
[null,150,76,{"$f":"O22","v":96},{"$f":"O36","v":112},125,144,143,null,null,null,150,130,127,112,116,104,99,96,90,81,62,41,null,null,null,150,130,111.6,95,77.666666666666671,51.5,null,null,150,{"$f":"HLOOKUP($AX$8,$M$32:$X$41,5)","v":130},{"$f":"HLOOKUP($AX$9,$M$32:$X$41,5)","v":130},"PSI1:",{"$f":"LARGE(L34:L41,COUNTIF(L34:L41,\">\" &AX5)+1)","v":{"$error":"#NUM!"}},null,null,"PSO1:",{"$f":"VLOOKUP(AM36,L34:M41,2)","v":{"$error":"#NUM!"}}]
[null,200,96,115,132,146,160,193,null,null,null,200,148,141,132,130,128,124,124,114,107,103,89,64,null,null,200,148,131,120.66666666666667,108,85.333333333333329,null,null,200,{"$f":"HLOOKUP($AX$8,$M$32:$X$41,6)","v":148},{"$f":"HLOOKUP($AX$9,$M$32:$X$41,6)","v":148},"PSI2:",{"$f":"SMALL(L34:L41,COUNTIF(L34:L41,\"<\" &AX5)+1)","v":50},null,null,"PSO2:",{"$f":"VLOOKUP(AM37,L34:M41,2)","v":50}]
[null,250,116,134,152,166,183,194,null,null,null,250,170,157,152,147,146,144,142,136,133,126,120,114,null,null,250,170,149.19999999999999,140.66666666666666,131.66666666666666,120,null,null,250,{"$f":"HLOOKUP($AX$8,$M$32:$X$41,7)","v":170},{"$f":"HLOOKUP($AX$9,$M$32:$X$41,7)","v":170}]
[null,300,136,152,171,186,201,216,null,null,null,300,191,187,171,166,163,163,162,157,151,149,142,137,null,null,300,191,170,160.66666666666666,152.33333333333334,142.66666666666666,null,null,300,{"$f":"HLOOKUP($AX$8,$M$32:$X$41,8)","v":191},{"$f":"HLOOKUP($AX$9,$M$32:$X$41,8)","v":191}]
[null,350,156,174,191,205,221,235,null,null,null,350,209,204,191,191,193,182,187,175,172,167,163,158,null,null,350,209,192.2,181.33333333333334,171.33333333333334,162.66666666666666,null,null,350,{"$f":"HLOOKUP($AX$8,$M$32:$X$41,9)","v":209},{"$f":"HLOOKUP($AX$9,$M$32:$X$41,9)","v":209}]
[null,400,177,197,212,242,239,257,null,null,null,400,233,218,212,206,203,202,196,193,196,186,181,175,null,null,400,233,208.2,197,191.66666666666666,180.66666666666666,null,null,400,{"$f":"HLOOKUP($AX$8,$M$32:$X$41,10)","v":233},{"$f":"HLOOKUP($AX$9,$M$32:$X$41,10)","v":233}]
[]
[]
[]
[null,"150 GPM FLOW RATE",null,null,null,null,null,null,null,null,"Bonnet Setting","Inlet Pressure psig","OUTLET PRESSURES @ FLOW RATE, GPM",null,null,null,null,null,null,null,null,null,null,null,null,null,"Setting # 4: Inlet vs. Outlet Pressure Over Flow Range",null,null,null,null,null,null,null,"SETTING 4"]
[null,"Inlet (psig)","Outlet-1 (psig)","Outlet-2 (psig)","Outlet-3 (psig)","Outlet-4 (psig)","Outlet-5 (psig)","Outlet-6 (psig)",null,null,null,null,0,50,100,150,175,200,250,300,350,400,450,500,null,null,"Inlet (psig)","Static","50-200 [GPM]","200-300 [GPM]","300-400 [GPM]","400-500 [GPM]",null,null,"Inlet (psig)",{"$f":"CONCATENATE(\"Outlet Residual @ \" &AX$8& \" GPM\")","v":"Outlet Residual @ 0 GPM"},{"$f":"CONCATENATE(\"Outlet Residual @ \" &AX$9& \" GPM\")","v":"Outlet Residual @ 0 GPM"},null,null,"Const. PRI Interpolated @ Var. Flow"]
[null,0,{"$f":"P5","v":0},{"$f":"P19","v":0},{"$f":"P33","v":0},{"$f":"P47","v":0},{"$f":"P61","v":0},{"$f":"P75","v":0},null,null,4,0,null,null,null,null,null,null,null,null,null,null,null,null,null,null,{"$f":"L47","v":0}]
[null,50,27,{"$f":"P20","v":36},{"$f":"P34","v":37},{"$f":"P48","v":37},{"$f":"P62","v":37},{"$f":"P76","v":37},null,null,null,50,50,48,44,37,32,27,15,null,null,null,null,null,null,null,{"$f":"L48","v":50},{"$f":"M48","v":50},{"$f":"AVERAGE(N48:R48)","v":37.6},{"$f":"AVERAGE(R48:T48)","v":21},{"$f":"AVERAGE(T48:V48)","v":{"$error":"#DIV/0!"}},{"$f":"AVERAGE(V48:X48)","v":{"$error":"#DIV/0!"}},null,null,{"$f":"L48","v":50},{"$f":"HLOOKUP($AX$8,$M$46:$X$55,3)","v":50},{"$f":"HLOOKUP($AX$9,$M$46:$X$55,3)","v":50},"PRI1:",{"$f":"LARGE(L48:L55,COUNTIF(L48:L55,\">\" &AX6)+1)","v":{"$error":"#NUM!"}},{"$f":"VLOOKUP(AM48,AI48:AK55,2)","v":{"$error":"#NUM!"}},{"$f":"VLOOKUP(AM48,AI48:AK55,3)","v":{"$error":"#NUM!"}},"PRO1:",{"$f":"IF(AX8=AX9, AN48, FORECAST(AX7,$AN$48:$AO$48,$AX$8:$AX$9))","v":{"$error":"#NUM!"}}]
[null,100,52,{"$f":"P21","v":67},{"$f":"P35","v":79},{"$f":"P49","v":87},{"$f":"P63","v":87},{"$f":"P77","v":87},null,null,null,100,100,99,94,87,83,78,64,50,33,null,null,null,null,null,100,100,{"$f":"AVERAGE(N49:R49)","v":88.2},{"$f":"AVERAGE(R49:T49)","v":64},{"$f":"AVERAGE(T49:V49)","v":41.5},{"$f":"AVERAGE(V49:X49)","v":{"$error":"#DIV/0!"}},null,null,{"$f":"L49","v":100},{"$f":"HLOOKUP($AX$8,$M$46:$X$55,4)","v":100},{"$f":"HLOOKUP($AX$9,$M$46:$X$55,4)","v":100},"PRI2:",{"$f":"SMALL(L48:L55,COUNTIF(L48:L55,\"<\" &AX6)+1)","v":50},{"$f":"VLOOKUP(AM49,AI48:AK55,2)","v":50},{"$f":"VLOOKUP(AM49,AI48:AK55,3)","v":50},"PRO2:",{"$f":"IF(AX8=AX9, AN49, FORECAST(AX7,$AN$49:$AO$49,$AX$8:$AX$9))","v":50}]
[null,150,73,{"$f":"P22","v":91},116,118,137,136,null,null,null,150,150,144,125,118,116,111,106,100,82,62,40,null,null,null,150,150,122.8,105.66666666666667,81.333333333333329,51,null,null,150,{"$f":"HLOOKUP($AX$8,$M$46:$X$55,5)","v":150},{"$f":"HLOOKUP($AX$9,$M$46:$X$55,5)","v":150},"PSI1:",{"$f":"LARGE(L48:L55,COUNTIF(L48:L55,\">\" &AX5)+1)","v":{"$error":"#NUM!"}},null,null,"PSO1:",{"$f":"VLOOKUP(AM50,L48:M55,2)","v":{"$error":"#NUM!"}}]
[null,200,92,118,130,146,152,183,null,null,null,200,173,169,146,146,145,139,131,125,119,112,90,63,null,null,200,173,149,131.66666666666666,118.66666666666667,88.333333333333329,null,null,200,{"$f":"HLOOKUP($AX$8,$M$46:$X$55,6)","v":173},{"$f":"HLOOKUP($AX$9,$M$46:$X$55,6)","v":173},"PSI2:",{"$f":"SMALL(L48:L55,COUNTIF(L48:L55,\"<\" &AX5)+1)","v":50},null,null,"PSO2:",{"$f":"VLOOKUP(AM51,L48:M55,2)","v":50}]
[null,250,111,131,147,163,178,188,null,null,null,250,192,185,166,163,162,157,153,149,144,140,133,113,null,null,250,192,166.6,153,144.33333333333334,128.66666666666666,null,null,250,{"$f":"HLOOKUP($AX$8,$M$46:$X$55,7)","v":192},{"$f":"HLOOKUP($AX$9,$M$46:$X$55,7)","v":192}]
[null,300,130,150,166,181,197,212,null,null,null,300,212,202,186,181,180,182,175,172,166,160,162,151,null,null,300,212,186.2,176.33333333333334,166,157.66666666666666,null,null,300,{"$f":"HLOOKUP($AX$8,$M$46:$X$55,8)","v":212},{"$f":"HLOOKUP($AX$9,$M$46:$X$55,8)","v":212}]
[null,350,151,170,191,200,215,228,null,null,null,350,225,212,205,200,202,208,195,194,185,180,175,175,null,null,350,225,205.4,199,186.33333333333334,176.66666666666666,null,null,350,{"$f":"HLOOKUP($AX$8,$M$46:$X$55,9)","v":225},{"$f":"HLOOKUP($AX$9,$M$46:$X$55,9)","v":225}]
[null,400,172,191,206,219,236,249,null,null,null,400,255,248,242,219,216,224,222,210,206,200,204,189,null,null,400,255,229.8,218.66666666666666,205.33333333333334,197.66666666666666,null,null,400,{"$f":"HLOOKUP($AX$8,$M$46:$X$55,10)","v":255},{"$f":"HLOOKUP($AX$9,$M$46:$X$55,10)","v":255}]
[]
[]
[]
[null,"175 GPM FLOW RATE",null,null,null,null,null,null,null,null,"Bonnet Setting","Inlet Pressure psig","OUTLET PRESSURES @ FLOW RATE, GPM",null,null,null,null,null,null,null,null,null,null,null,null,null,"Setting # 5: Inlet vs. Outlet Pressure Over Flow Range",null,null,null,null,null,null,null,"SETTING 5"]
[null,"Inlet (psig)","Outlet-1 (psig)","Outlet-2 (psig)","Outlet-3 (psig)","Outlet-4 (psig)","Outlet-5 (psig)","Outlet-6 (psig)",null,null,null,null,0,50,100,150,175,200,250,300,350,400,450,500,null,null,"Inlet (psig)","Static","50-200 [GPM]","200-300 [GPM]","300-400 [GPM]","400-500 [GPM]",null,null,"Inlet (psig)",{"$f":"CONCATENATE(\"Outlet Residual @ \" &AX$8& \" GPM\")","v":"Outlet Residual @ 0 GPM"},{"$f":"CONCATENATE(\"Outlet Residual @ \" &AX$9& \" GPM\")","v":"Outlet Residual @ 0 GPM"},null,null,"Const. PRI Interpolated @ Var. Flow"]
[null,0,{"$f":"Q5","v":0},{"$f":"Q19","v":0},{"$f":"Q33","v":0},{"$f":"Q47","v":0},{"$f":"Q61","v":0},{"$f":"Q75","v":0},null,null,5,0,null,null,null,null,null,null,null,null,null,null,null,null,null,null,{"$f":"L61","v":0}]
[null,50,{"$f":"Q6","v":23},{"$f":"Q20","v":32},{"$f":"Q34","v":32},{"$f":"Q48","v":32},{"$f":"Q62","v":32},{"$f":"Q76","v":32},null,null,null,50,50,48,44,37,32,26,14,null,null,null,null,null,null,null,{"$f":"L62","v":50},{"$f":"M62","v":50},{"$f":"AVERAGE(N62:R62)","v":37.4},{"$f":"AVERAGE(R62:T62)","v":20},{"$f":"AVERAGE(T62:V62)","v":{"$error":"#DIV/0!"}},{"$f":"AVERAGE(V62:X62)","v":{"$error":"#DIV/0!"}},null,null,{"$f":"L62","v":50},{"$f":"HLOOKUP($AX$8,$M$60:$X$69,3)","v":50},{"$f":"HLOOKUP($AX$9,$M$60:$X$69,3)","v":50},"PRI1:",{"$f":"LARGE(L62:L69,COUNTIF(L62:L69,\">\" &AX6)+1)","v":{"$error":"#NUM!"}},{"$f":"VLOOKUP(AM62,AI62:AK69,2)","v":{"$error":"#NUM!"}},{"$f":"VLOOKUP(AM62,AI62:AK69,3)","v":{"$error":"#NUM!"}},"PRO1:",{"$f":"IF(AX8=AX9, AN62, FORECAST(AX7,$AN$62:$AO$62,$AX$8:$AX$9))","v":{"$error":"#NUM!"}}]
[null,100,{"$f":"Q7","v":47},{"$f":"Q21","v":64},{"$f":"Q35","v":77},{"$f":"Q49","v":83},{"$f":"Q63","v":82},{"$f":"Q77","v":83},null,null,null,100,100,100,94,87,82,78,65,51,33,null,null,null,null,null,100,100,{"$f":"AVERAGE(N63:R63)","v":88.2},{"$f":"AVERAGE(R63:T63)","v":64.666666666666671},{"$f":"AVERAGE(T63:V63)","v":42},{"$f":"AVERAGE(V63:X63)","v":{"$error":"#DIV/0!"}},null,null,{"$f":"L63","v":100},{"$f":"HLOOKUP($AX$8,$M$60:$X$69,4)","v":100},{"$f":"HLOOKUP($AX$9,$M$60:$X$69,4)","v":100},"PRI2:",{"$f":"SMALL(L62:L69,COUNTIF(L62:L69,\"<\" &AX6)+1)","v":50},{"$f":"VLOOKUP(AM63,AI62:AK69,2)","v":50},{"$f":"VLOOKUP(AM63,AI62:AK69,3)","v":50},"PRO2:",{"$f":"IF(AX8=AX9, AN63, FORECAST(AX7,$AN$63:$AO$63,$AX$8:$AX$9))","v":50}]
[null,150,{"$f":"Q8","v":71},{"$f":"Q22","v":88},104,116,133,133,null,null,null,150,150,149,144,137,133,127,118,99,83,62,41,null,null,null,150,150,138,114.66666666666667,81.333333333333329,51.5,null,null,150,{"$f":"HLOOKUP($AX$8,$M$60:$X$69,5)","v":150},{"$f":"HLOOKUP($AX$9,$M$60:$X$69,5)","v":150},"PSI1:",{"$f":"LARGE(L62:L69,COUNTIF(L62:L69,\">\" &AX5)+1)","v":{"$error":"#NUM!"}},null,null,"PSO1:",{"$f":"VLOOKUP(AM64,L62:M69,2)","v":{"$error":"#NUM!"}}]
[null,200,92,110,128,145,150,175,null,null,null,200,199,190,160,152,150,148,142,146,131,111,88,65,null,null,200,199,160,145.33333333333334,129.33333333333334,88,null,null,200,{"$f":"HLOOKUP($AX$8,$M$60:$X$69,6)","v":199},{"$f":"HLOOKUP($AX$9,$M$60:$X$69,6)","v":199},"PSI2:",{"$f":"SMALL(L62:L69,COUNTIF(L62:L69,\"<\" &AX5)+1)","v":50},null,null,"PSO2:",{"$f":"VLOOKUP(AM65,L62:M69,2)","v":50}]
[null,250,108,134,146,162,172,189,null,null,null,250,220,202,183,178,172,171,165,160,159,153,139,115,null,null,250,220,181.2,165.33333333333334,157.33333333333334,135.66666666666666,null,null,250,{"$f":"HLOOKUP($AX$8,$M$60:$X$69,7)","v":220},{"$f":"HLOOKUP($AX$9,$M$60:$X$69,7)","v":220}]
[null,300,128,148,163,180,195,216,null,null,null,300,240,208,201,197,195,191,188,190,180,175,167,163,null,null,300,240,198.4,189.66666666666666,181.66666666666666,168.33333333333334,null,null,300,{"$f":"HLOOKUP($AX$8,$M$60:$X$69,8)","v":240},{"$f":"HLOOKUP($AX$9,$M$60:$X$69,8)","v":240}]
[null,350,149,168,193,202,213,228,null,null,null,350,256,227,221,215,213,217,207,217,198,191,189,183,null,null,350,256,218.6,213.66666666666666,202,187.66666666666666,null,null,350,{"$f":"HLOOKUP($AX$8,$M$60:$X$69,9)","v":256},{"$f":"HLOOKUP($AX$9,$M$60:$X$69,9)","v":256}]
[null,400,169,188,203,216,231,247,null,null,null,400,278,247,239,236,231,229,231,222,224,216,219,201,null,null,400,278,236.4,227.33333333333334,220.66666666666666,212,null,null,400,{"$f":"HLOOKUP($AX$8,$M$60:$X$69,10)","v":278},{"$f":"HLOOKUP($AX$9,$M$60:$X$69,10)","v":278}]
[]
[]
[]
[null,"200 GPM FLOW RATE",null,null,null,null,null,null,null,null,"Bonnet Setting","Inlet Pressure psig","OUTLET PRESSURES @ FLOW RATE, GPM",null,null,null,null,null,null,null,null,null,null,null,null,null,"Setting # 6: Inlet vs. Outlet Pressure Over Flow Range",null,null,null,null,null,null,null,"SETTING 6"]
[null,"Inlet (psig)","Outlet-1 (psig)","Outlet-2 (psig)","Outlet-3 (psig)","Outlet-4 (psig)","Outlet-5 (psig)","Outlet-6 (psig)",null,null,null,null,0,50,100,150,175,200,250,300,350,400,450,500,null,null,"Inlet (psig)","Static","50-200 [GPM]","200-300 [GPM]","300-400 [GPM]","400-500 [GPM]",null,null,"Inlet (psig)",{"$f":"CONCATENATE(\"Outlet Residual @ \" &AX$8& \" GPM\")","v":"Outlet Residual @ 0 GPM"},{"$f":"CONCATENATE(\"Outlet Residual @ \" &AX$9& \" GPM\")","v":"Outlet Residual @ 0 GPM"},null,null,"Const. PRI Interpolated @ Var. Flow"]
[null,0,{"$f":"R5","v":0},{"$f":"R19","v":0},{"$f":"R33","v":0},{"$f":"R47","v":0},{"$f":"R61","v":0},{"$f":"R75","v":0},null,null,6,0,null,null,null,null,null,null,null,null,null,null,null,null,null,null,{"$f":"L75","v":0}]
[null,50,20,{"$f":"R20","v":26},{"$f":"R34","v":27},{"$f":"R48","v":27},{"$f":"R62","v":26},{"$f":"R76","v":27},null,null,null,50,50,49,43,37,32,27,15,null,null,null,null,null,null,null,{"$f":"L76","v":50},{"$f":"M76","v":50},{"$f":"AVERAGE(N76:R76)","v":37.6},{"$f":"AVERAGE(R76:T76)","v":21},{"$f":"AVERAGE(T76:V76)","v":{"$error":"#DIV/0!"}},{"$f":"AVERAGE(V76:X76)","v":{"$error":"#DIV/0!"}},null,null,{"$f":"L76","v":50},{"$f":"HLOOKUP($AX$8,$M$74:$X$83,3)","v":50},{"$f":"HLOOKUP($AX$9,$M$74:$X$83,3)","v":50},"PRI1:",{"$f":"LARGE(L76:L83,COUNTIF(L76:L83,\">\" &AX6)+1)","v":{"$error":"#NUM!"}},{"$f":"VLOOKUP(AM76,AI76:AK83,2)","v":{"$error":"#NUM!"}},{"$f":"VLOOKUP(AM76,AI76:AK83,3)","v":{"$error":"#NUM!"}},"PRO1:",{"$f":"IF(AX8=AX9, AN76, FORECAST(AX7,$AN$76:$AO$76,$AX$8:$AX$9))","v":{"$error":"#NUM!"}}]
[null,100,46,{"$f":"R21","v":62},{"$f":"R35","v":73},{"$f":"R49","v":78},{"$f":"R63","v":78},{"$f":"R77","v":77},null,null,null,100,100,99,94,87,83,77,63,50,32,null,null,null,null,null,100,100,{"$f":"AVERAGE(N77:R77)","v":88},{"$f":"AVERAGE(R77:T77)","v":63.333333333333336},{"$f":"AVERAGE(T77:V77)","v":41},{"$f":"AVERAGE(V77:X77)","v":{"$error":"#DIV/0!"}},null,null,{"$f":"L77","v":100},{"$f":"HLOOKUP($AX$8,$M$74:$X$83,4)","v":100},{"$f":"HLOOKUP($AX$9,$M$74:$X$83,4)","v":100},"PRI2:",{"$f":"SMALL(L76:L83,COUNTIF(L76:L83,\"<\" &AX6)+1)","v":50},{"$f":"VLOOKUP(AM77,AI76:AK83,2)","v":50},{"$f":"VLOOKUP(AM77,AI76:AK83,3)","v":50},"PRO2:",{"$f":"IF(AX8=AX9, AN77, FORECAST(AX7,$AN$77:$AO$77,$AX$8:$AX$9))","v":50}]
[null,150,69,{"$f":"R22","v":87},99,111,127,126,null,null,null,150,150,149,143,136,133,126,115,99,83,64,41,null,null,null,150,150,137.4,113.33333333333333,82,52.5,null,null,150,{"$f":"HLOOKUP($AX$8,$M$74:$X$83,5)","v":150},{"$f":"HLOOKUP($AX$9,$M$74:$X$83,5)","v":150},"PSI1:",{"$f":"LARGE(L76:L83,COUNTIF(L76:L83,\">\" &AX5)+1)","v":{"$error":"#NUM!"}},null,null,"PSO1:",{"$f":"VLOOKUP(AM78,L76:M83,2)","v":{"$error":"#NUM!"}}]
[null,200,90,113,124,139,148,166,null,null,null,200,200,199,193,183,175,166,154,145,132,112,89,66,null,null,200,200,183.2,155,129.66666666666666,89,null,null,200,{"$f":"HLOOKUP($AX$8,$M$74:$X$83,6)","v":200},{"$f":"HLOOKUP($AX$9,$M$74:$X$83,6)","v":200},"PSI2:",{"$f":"SMALL(L76:L83,COUNTIF(L76:L83,\"<\" &AX5)+1)","v":50},null,null,"PSO2:",{"$f":"VLOOKUP(AM79,L76:M83,2)","v":50}]
[null,250,111,130,144,157,171,185,null,null,null,250,238,228,194,188,189,185,177,174,165,157,139,116,null,null,250,238,196.8,178.66666666666666,165.33333333333334,137.33333333333334,null,null,250,{"$f":"HLOOKUP($AX$8,$M$74:$X$83,7)","v":238},{"$f":"HLOOKUP($AX$9,$M$74:$X$83,7)","v":238}]
[null,300,126,146,163,182,191,206,null,null,null,300,261,222,216,212,216,206,201,197,198,207,184,164,null,null,300,261,214.4,201.33333333333334,200.66666666666666,185,null,null,300,{"$f":"HLOOKUP($AX$8,$M$74:$X$83,8)","v":261},{"$f":"HLOOKUP($AX$9,$M$74:$X$83,8)","v":261}]
[null,350,147,164,182,208,217,227,null,null,null,350,266,241,235,228,228,227,230,218,210,207,200,194,null,null,350,266,231.8,225,211.66666666666666,200.33333333333334,null,null,350,{"$f":"HLOOKUP($AX$8,$M$74:$X$83,9)","v":266},{"$f":"HLOOKUP($AX$9,$M$74:$X$83,9)","v":266}]
[null,400,167,185,202,224,229,244,null,null,null,400,298,264,257,249,247,244,242,238,232,228,222,216,null,null,400,298,252.2,241.33333333333334,232.66666666666666,222,null,null,400,{"$f":"HLOOKUP($AX$8,$M$74:$X$83,10)","v":298},{"$f":"HLOOKUP($AX$9,$M$74:$X$83,10)","v":298}]
[]
[]
[]
[null,"250 GPM FLOW RATE"]
[null,"Inlet (psig)","Outlet-1 (psig)","Outlet-2 (psig)","Outlet-3 (psig)","Outlet-4 (psig)","Outlet-5 (psig)","Outlet-6 (psig)"]
[null,0,{"$f":"S5","v":0},{"$f":"S19","v":0},{"$f":"S33","v":0},{"$f":"S47","v":0},{"$f":"S61","v":0},{"$f":"S75","v":0}]
[null,50,{"$f":"S6","v":14},{"$f":"S20","v":15},{"$f":"S34","v":14},{"$f":"S48","v":15},{"$f":"S62","v":14},{"$f":"S76","v":15}]
[null,100,{"$f":"S7","v":42},{"$f":"S21","v":56},{"$f":"S35","v":64},{"$f":"S49","v":64},{"$f":"S63","v":65},{"$f":"S77","v":63}]
[null,150,{"$f":"S8","v":64},{"$f":"S22","v":86},96,106,118,115]
[null,200,85,104,124,131,142,154]
[null,250,105,126,142,153,165,177]
[null,300,120,143,162,175,188,201]
[null,350,142,159,187,195,207,230]
[null,400,162,179,196,222,231,242]
[]
[]
[]
[null,"300 GPM FLOW RATE"]
[null,"Inlet (psig)","Outlet-1 (psig)","Outlet-2 (psig)","Outlet-3 (psig)","Outlet-4 (psig)","Outlet-5 (psig)","Outlet-6 (psig)"]
[null,0,{"$f":"T5","v":0},{"$f":"T19","v":0},{"$f":"T33","v":0},{"$f":"T47","v":0},{"$f":"T61","v":0},{"$f":"T75","v":0}]
[null,50,0,0,{"$f":"T34","v":0},{"$f":"T48","v":0},{"$f":"T62","v":0},{"$f":"T76","v":0}]
[null,100,36,30,{"$f":"T35","v":49},{"$f":"T49","v":50},{"$f":"T63","v":51},{"$f":"T77","v":50}]
[null,150,60,77,{"$f":"T36","v":90},{"$f":"T50","v":100},{"$f":"T64","v":99},{"$f":"T78","v":99}]
[null,200,81,101,114,125,146,145]
[null,250,101,120,136,149,160,174]
[null,300,120,139,157,172,190,197]
[null,350,134,159,175,194,217,218]
[null,400,154,173,193,210,222,238]
[]
[]
[]
[null,"350 GPM FLOW RATE"]
[null,"Inlet (psig)","Outlet-1 (psig)","Outlet-2 (psig)","Outlet-3 (psig)","Outlet-4 (psig)","Outlet-5 (psig)","Outlet-6 (psig)"]
[null,0,{"$f":"U5","v":0},{"$f":"U19","v":0},{"$f":"U33","v":0},{"$f":"U47","v":0},{"$f":"U61","v":0},{"$f":"U75","v":0}]
[null,50,0,0,{"$f":"U34","v":0},{"$f":"U48","v":0},{"$f":"U62","v":0},{"$f":"U76","v":0}]
[null,100,31,0,{"$f":"U35","v":31},{"$f":"U49","v":33},{"$f":"U63","v":33},{"$f":"U77","v":32}]
[null,150,54,74,{"$f":"U36","v":81},{"$f":"U50","v":82},{"$f":"U64","v":83},{"$f":"U78","v":83}]
[null,200,76,93,107,119,131,132]
[null,250,96,114,133,144,159,165]
[null,300,116,135,151,166,180,198]
[null,350,133,154,172,185,198,210]
[null,400,149,167,196,206,224,232]
[]
[]
[]
[null,"400 GPM FLOW RATE"]
[null,"Inlet (psig)","Outlet-1 (psig)","Outlet-2 (psig)","Outlet-3 (psig)","Outlet-4 (psig)","Outlet-5 (psig)","Outlet-6 (psig)"]
[null,0,{"$f":"V5","v":0},{"$f":"V19","v":0},{"$f":"V33","v":0},{"$f":"V47","v":0},{"$f":"V61","v":0},{"$f":"V75","v":0}]
[null,50,0,0,0,0,0,0]
[null,100,0,0,0,0,0,0]
[null,150,49,61,62,62,62,64]
[null,200,71,88,103,112,111,112]
[null,250,91,109,126,140,153,157]
[null,300,109,130,149,160,175,207]
[null,350,128,148,167,180,191,207]
[null,400,151,170,186,200,216,228]
[]
[]
[]
[null,"450 GPM FLOW RATE"]
[null,"Inlet (psig)","Outlet-1 (psig)","Outlet-2 (psig)","Outlet-3 (psig)","Outlet-4 (psig)","Outlet-5 (psig)","Outlet-6 (psig)"]
[null,0,{"$f":"W5","v":0},{"$f":"W19","v":0},{"$f":"W33","v":0},{"$f":"W47","v":0},{"$f":"W61","v":0},{"$f":"W75","v":0}]
[null,50,0,0,0,0,0,0]
[null,100,0,0,0,0,0,0]
[null,150,41,38,41,40,41,41]
[null,200,65,83,89,90,88,89]
[null,250,85,105,120,133,139,139]
[null,300,105,124,142,162,167,184]
[null,350,125,143,163,175,189,200]
[null,400,148,165,181,204,219,222]
[]
[]
[]
[null,"500 GPM FLOW RATE"]
[null,"Inlet (psig)","Outlet-1 (psig)","Outlet-2 (psig)","Outlet-3 (psig)","Outlet-4 (psig)","Outlet-5 (psig)","Outlet-6 (psig)"]
[null,0,{"$f":"X5","v":0},{"$f":"X19","v":0},{"$f":"X33","v":0},{"$f":"X47","v":0},{"$f":"X61","v":0},{"$f":"X75","v":0}]
[null,50,0,0,0,0,0,0]
[null,100,0,0,0,0,0,0]
[null,150,0,0,0,0,0,0]
[null,200,60,64,64,63,65,66]
[null,250,81,98,114,113,115,116]
[null,300,99,120,137,151,163,164]
[null,350,120,138,158,175,183,194]
[null,400,144,159,175,189,201,216]

{"sheet":"Charts 2.5\" Angle","index":5,"n_rows":2,"n_cols":2,"rows_kept":2,"cut":false,"hidden":false,"merged":[[1,1,2,7]]}
[]
[null,"2.5\" ANGLE"]

{"sheet":"IE2600A-250-Angle_DATA","index":6,"n_rows":114,"n_cols":39,"rows_kept":114,"cut":false,"hidden":true,"merged":[[72,23,72,31],[73,23,74,23],[73,24,74,24],[73,25,74,25],[73,28,74,29],[74,3,82,3],[72,19,72,20],[60,3,68,3],[72,3,73,3],[72,4,73,4],[72,5,72,16],[58,3,59,3],[58,4,59,4],[58,5,58,16],[58,19,58,20],[58,23,58,31],[59,23,60,23],[59,24,60,24],[59,25,60,25],[59,28,60,29],[44,23,44,31],[45,23,46,23],[45,24,46,24],[45,25,46,25],[45,28,46,29],[46,3,54,3],[32,3,40,3],[44,3,45,3],[44,4,45,4],[44,5,44,16],[44,19,44,20],[30,3,31,3],[30,4,31,4],[30,5,30,16],[30,19,30,20],[21,34,21,35],[22,34,22,35],[23,34,23,35],[30,23,30,31],[31,23,32,23],[31,24,32,24],[31,25,32,25],[31,28,32,29],[24,34,24,35],[16,3,17,3],[16,4,17,4],[16,5,16,16],[16,19,16,20],[7,34,7,36],[8,34,8,36],[16,23,16,31],[17,23,18,23],[17,24,18,24],[17,25,18,25],[17,28,18,29],[17,34,17,35],[18,3,26,3],[18,34,18,35],[19,34,19,35],[20,34,20,35],[3,34,3,38],[0,0,0,16],[2,3,3,3],[2,4,3,4],[2,5,2,16],[2,19,2,20],[2,23,2,31],[3,23,4,23],[3,24,4,24],[3,25,4,25],[3,28,4,29],[4,3,12,3],[4,34,4,36],[5,34,5,36],[6,34,6,36],[0,17,0,20],[86,3,87,3],[86,4,87,4],[86,5,86,16],[88,3,96,3],[86,19,86,20],[86,23,86,31],[87,23,88,23],[87,24,88,24],[87,25,88,25],[87,28,88,29]]}
["Data from Project#x4789893180, Date: 2021-04-07",null,null,null,null,null,null,null,null,null,null,null,null,null,null,null,null,"Double click this icon to open UL results "]
[null,null,null,null,"Residual ","Static"]
[null,null,null,"Bonnet Setting","Inlet Pressure psig","OUTLET PRESSURES @ FLOW RATE, GPM",null,null,null,null,null,null,null,null,null,null,null,null,null,"Setting # 1: Inlet Pressure",null,null,null,"SETTING 1"]
[null,null,null,null,null,0,50,100,150,175,200,250,300,350,400,450,500,null,null,"Inlet (psig)","Static",null,null,"Inlet (psig)",{"$f":"CONCATENATE(\"Outlet Residual @ \" &AM$8& \" GPM\")","v":"Outlet Residual @ 0 GPM"},{"$f":"CONCATENATE(\"Outlet Residual @ \" &AM$9& \" GPM\")","v":"Outlet Residual @ 0 GPM"},null,null,"Const. PRI Interpolated @ Var. Flow",null,null,null,null,null,"VARIABLES"]
[null,null,null,1,0,0,0,0,0,0,0,0,0,0,0,0,0,null,null,{"$f":"E5","v":0},{"$f":"F5","v":0},null,null,null,null,null,null,null,null,null,null,null,null,null,"Static Inlet Pressure",null,null,"PSI:",{"$f":"Database!$E$2","v":0}]
[null,null,null,null,50,21,17,16,19,15,15,16,null,null,null,null,null,null,null,{"$f":"E6","v":50},{"$f":"F6","v":21},null,null,{"$f":"E6","v":50},{"$f":"HLOOKUP($AM$8,$F$4:$Q$13,3)","v":21},{"$f":"HLOOKUP($AM$9,$F$4:$Q$13,3)","v":21},"PRI1:",{"$f":"LARGE(E6:E13,COUNTIF(E6:E13,\">\" &AM6)+1)","v":{"$error":"#NUM!"}},{"$f":"VLOOKUP(AB6,X6:Z13,2)","v":{"$error":"#NUM!"}},{"$f":"VLOOKUP(AB6,X6:Z13,3)","v":{"$error":"#NUM!"}},"PRO1:",{"$f":"IF(AM8=AM9, AC6, FORECAST(AM7,$AC$6:$AD$6,$AM$8:$AM$9))","v":{"$error":"#NUM!"}},null,null,"Residual Inlet Pressure",null,null,"PRI:",{"$f":"Database!$E$3","v":0}]
[null,null,null,null,100,49,39,37,33,32,37,38,34,37,30,null,null,null,null,100,49,null,null,{"$f":"E7","v":100},{"$f":"HLOOKUP($AM$8,$F$4:$Q$13,4)","v":49},{"$f":"HLOOKUP($AM$9,$F$4:$Q$13,4)","v":49},"PRI2:",{"$f":"SMALL(E6:E13,COUNTIF(E6:E13,\"<\" &AM6)+1)","v":50},{"$f":"VLOOKUP(AB7,X6:Z13,2)","v":21},{"$f":"VLOOKUP(AB7,X6:Z13,3)","v":21},"PRO2:",{"$f":"IF(AM8=AM9, AC7, FORECAST(AM7,$AC$7:$AD$7,$AM$8:$AM$9))","v":21},null,null,"Flow Rate",null,null,"Q0:",{"$f":"IF(Database!$E$4=500,499.99,Database!$E$4)","v":0}]
[null,null,null,null,150,75,66,60,62,57,58,55,55,53,53,52,49,null,null,150,75,null,null,150,{"$f":"HLOOKUP($AM$8,$F$4:$Q$13,5)","v":75},{"$f":"HLOOKUP($AM$9,$F$4:$Q$13,5)","v":75},"PSI1:",{"$f":"LARGE(E6:E13,COUNTIF(E6:E13,\">\" &AM5)+1)","v":{"$error":"#NUM!"}},null,null,"PSO1:",{"$f":"VLOOKUP(AB8,E6:F13,2)","v":{"$error":"#NUM!"}},null,null,"Nearest known Flow Rate, 1",null,null,"Q1:",{"$f":"LARGE(F4:Q4,COUNTIF(F4:Q4,\">\" &AM7)+1)","v":0}]
[null,null,null,null,200,93,79,76,73,71,69,67,75,74,74,73,72,null,null,200,93,null,null,200,{"$f":"HLOOKUP($AM$8,$F$4:$Q$13,6)","v":93},{"$f":"HLOOKUP($AM$9,$F$4:$Q$13,6)","v":93},"PSI2:",{"$f":"SMALL(E6:E13,COUNTIF(E6:E13,\"<\" &AM5)+1)","v":50},null,null,"PSO2:",{"$f":"VLOOKUP(AB9,E6:F13,2)","v":21},null,null,"Nearest known Flow Rate, 2",null,null,"Q2:",{"$f":"SMALL(F4:Q4,COUNTIF(F4:Q4,\"<\" &AM7)+1)","v":0}]
[null,null,null,null,250,116,100,94,93,92,92,86,95,94,93,93,91,null,null,250,116,null,null,250,{"$f":"HLOOKUP($AM$8,$F$4:$Q$13,7)","v":116},{"$f":"HLOOKUP($AM$9,$F$4:$Q$13,7)","v":116}]
[null,null,null,null,300,127,120,113,112,113,112,108,105,114,113,112,111,null,null,300,127,null,null,300,{"$f":"HLOOKUP($AM$8,$F$4:$Q$13,8)","v":127},{"$f":"HLOOKUP($AM$9,$F$4:$Q$13,8)","v":127}]
[null,null,null,null,350,147,141,134,132,133,131,128,123,129,132,131,131,null,null,350,{"$f":"F12","v":147},null,null,350,{"$f":"HLOOKUP($AM$8,$F$4:$Q$13,9)","v":147},{"$f":"HLOOKUP($AM$9,$F$4:$Q$13,9)","v":147}]
[null,null,null,null,400,166,160,154,152,152,154,150,143,146,152,151,148,null,null,400,166,null,null,400,{"$f":"HLOOKUP($AM$8,$F$4:$Q$13,10)","v":166},{"$f":"HLOOKUP($AM$9,$F$4:$Q$13,10)","v":166}]
[]
[]
[null,null,null,null,"Residual ","Static"]
[null,null,null,"Bonnet Setting","Inlet Pressure psig","OUTLET PRESSURES @ FLOW RATE, GPM",null,null,null,null,null,null,null,null,null,null,null,null,null,"Setting # 2: Inlet Pressure",null,null,null,"SETTING 2"]
[null,null,null,null,null,0,50,100,150,175,200,250,300,350,400,450,500,null,null,"Inlet (psig)","Static",null,null,"Inlet (psig)",{"$f":"CONCATENATE(\"Outlet Residual @ \" &AM$8& \" GPM\")","v":"Outlet Residual @ 0 GPM"},{"$f":"CONCATENATE(\"Outlet Residual @ \" &AM$9& \" GPM\")","v":"Outlet Residual @ 0 GPM"},null,null,"Const. PRI Interpolated @ Var. Flow",null,null,null,null,null,"2.5\" Angle Double Spring",null,"Calculated Static Outlet Pressure","Calculated Residual Outlet Pressure","Max Flow Rate"]
[null,null,null,2,0,0,0,0,0,0,0,0,0,0,0,0,0,null,null,{"$f":"E19","v":0},{"$f":"F19","v":0},null,null,null,null,null,null,null,null,null,null,null,null,null,"Setting 1",null,{"$f":"IF($AF$8=$AF$9,$AF$8,FORECAST($AM$5,$AF$8:$AF$9,$AB$8:$AB$9))","v":{"$error":"#NUM!"}},{"$f":"IF($AF$6=$AF$7,$AF$6,FORECAST($AM$6,$AF$6:$AF$7,$AB$6:$AB$7))","v":{"$error":"#NUM!"}},500]
[null,null,null,null,50,37,32,26,21,19,20,16,14,null,null,null,null,null,null,{"$f":"E20","v":50},{"$f":"F20","v":37},null,null,{"$f":"E20","v":50},{"$f":"HLOOKUP($AM$8,$F$18:$Q$27,3)","v":37},{"$f":"HLOOKUP($AM$9,$F$18:$Q$27,3)","v":37},"PRI1:",{"$f":"LARGE(X20:X28,COUNTIF(X20:X28,\">\" &AM6)+1)","v":{"$error":"#NUM!"}},{"$f":"VLOOKUP(AB20,X20:Z27,2)","v":{"$error":"#NUM!"}},{"$f":"VLOOKUP(AB20,X20:Z27,3)","v":{"$error":"#NUM!"}},"PRO1:",{"$f":"IF(AM8=AM9, AC20, FORECAST(AM7,$AC$20:$AD$20,$AM$8:$AM$9))","v":{"$error":"#NUM!"}},null,null,"Setting 2",null,{"$f":"IF($AF$22=$AF$23,$AF$22,FORECAST($AM$5,$AF$22:$AF$23,$AB$22:$AB$23))","v":{"$error":"#NUM!"}},{"$f":"IF($AF$20=$AF$21,$AF$20,FORECAST($AM$6,$AF$20:$AF$21,$AB$20:$AB$21))","v":{"$error":"#NUM!"}},500]
[null,null,null,null,100,60,54,48,49,46,44,40,35,36,34,null,null,null,null,100,60,null,null,{"$f":"E21","v":100},{"$f":"HLOOKUP($AM$8,$F$18:$Q$27,4)","v":60},{"$f":"HLOOKUP($AM$9,$F$18:$Q$27,4)","v":60},"PRI2:",{"$f":"SMALL(X20:X28,COUNTIF(X20:X28,\"<\" &AM6)+1)","v":50},{"$f":"VLOOKUP(AB21,X20:Z27,2)","v":37},{"$f":"VLOOKUP(AB21,X20:Z27,3)","v":37},"PRO2:",{"$f":"IF(AM8=AM9, AC21, FORECAST(AM7,$AC$21:$AD$21,$AM$8:$AM$9))","v":37},null,null,"Setting 3",null,{"$f":"IF($AF$36=$AF$37,$AF$36,FORECAST($AM$5,$AF$36:$AF$37,$AB$36:$AB$37))","v":{"$error":"#NUM!"}},{"$f":"IF($AF$34=$AF$35,$AF$34,FORECAST($AM$6,$AF$34:$AF$35,$AB$34:$AB$35))","v":{"$error":"#NUM!"}},500]
[null,null,null,null,150,78,76,73,69,67,67,66,62,58,54,52,49,null,null,150,78,null,null,150,{"$f":"HLOOKUP($AM$8,$F$18:$Q$27,5)","v":78},{"$f":"HLOOKUP($AM$9,$F$18:$Q$27,5)","v":78},"PSI1:",{"$f":"LARGE(X20:X28,COUNTIF(X20:X28,\">\" &AM5)+1)","v":{"$error":"#NUM!"}},null,null,"PSO1:",{"$f":"VLOOKUP(AB22,T20:U28,2)","v":{"$error":"#NUM!"}},null,null,"Setting 4",null,{"$f":"IF($AF$50=$AF$51,$AF$50,FORECAST($AM$5,$AF$50:$AF$51,$AB$50:$AB$51))","v":{"$error":"#NUM!"}},{"$f":"IF($AF$48=$AF$49,$AF$48,FORECAST($AM$6,$AF$48:$AF$49,$AB$48:$AB$49))","v":{"$error":"#NUM!"}},500]
[null,null,null,null,200,102,95,89,88,87,84,84,83,80,76,73,71,null,null,200,102,null,null,200,{"$f":"HLOOKUP($AM$8,$F$18:$Q$27,6)","v":102},{"$f":"HLOOKUP($AM$9,$F$18:$Q$27,6)","v":102},"PSI2:",{"$f":"SMALL(X20:X28,COUNTIF(X20:X28,\"<\" &AM5)+1)","v":50},null,null,"PSO2:",{"$f":"VLOOKUP(AB23,T20:U28,2)","v":37},null,null,"Setting 5",null,{"$f":"IF($AF$64=$AF$65,$AF$64,FORECAST($AM$5,$AF$64:$AF$65,$AB$64:$AB$65))","v":{"$error":"#NUM!"}},{"$f":"IF($AF$62=$AF$63,$AF$62,FORECAST($AM$6,$AF$62:$AF$63,$AB$62:$AB$63))","v":{"$error":"#NUM!"}},500]
[null,null,null,null,250,123,116,111,108,111,106,104,105,103,99,94,93,null,null,250,123,null,null,250,{"$f":"HLOOKUP($AM$8,$F$18:$Q$27,7)","v":123},{"$f":"HLOOKUP($AM$9,$F$18:$Q$27,7)","v":123},null,null,null,null,null,null,null,null,"Setting 6",null,{"$f":"IF($AF$78=$AF$79,$AF$78,FORECAST($AM$5,$AF$78:$AF$79,$AB$78:$AB$79))","v":{"$error":"#NUM!"}},{"$f":"IF($AF$76=$AF$77,$AF$76,FORECAST($AM$6,$AF$76:$AF$77,$AB$76:$AB$77))","v":{"$error":"#NUM!"}},500]
[null,null,null,null,300,143,135,130,130,130,127,123,123,123,121,118,115,null,null,300,143,null,null,300,{"$f":"HLOOKUP($AM$8,$F$18:$Q$27,8)","v":143},{"$f":"HLOOKUP($AM$9,$F$18:$Q$27,8)","v":143},null,null,null,null,null,null,null,null,"Setting 7",null,{"$f":"IF($AF$92=$AF$93,$AF$92,FORECAST($AM$5,$AF$92:$AF$93,$AB$92:$AB$93))","v":{"$error":"#NUM!"}},{"$f":"IF($AF$90=$AF$91,$AF$90,FORECAST($AM$6,$AF$90:$AF$91,$AB$90:$AB$91))","v":{"$error":"#NUM!"}},500]
[null,null,null,null,350,163,156,156,148,150,145,143,140,144,142,137,135,null,null,{"$f":"E26","v":350},{"$f":"F26","v":163},null,null,350,{"$f":"HLOOKUP($AM$8,$F$18:$Q$27,9)","v":163},{"$f":"HLOOKUP($AM$9,$F$18:$Q$27,9)","v":163}]
[null,null,null,null,375,174,167,161,160,157,155,152,148,151,151,150,146,null,null,{"$f":"E27","v":375},{"$f":"F27","v":174},null,null,375,{"$f":"HLOOKUP($AM$8,$F$18:$Q$27,10)","v":174},{"$f":"HLOOKUP($AM$9,$F$18:$Q$27,10)","v":174}]
[null,null,null,null,null,null,null,null,null,null,null,null,null,null,null,null,null,null,null,400,{"$f":"U26+(((U27-U26)/(T27-T26))*(T28-T26))","v":185},null,null,400,{"$f":"Y26+(((Y27-Y26)/(X27-X26))*(X28-X26))","v":185},{"$f":"Z26+(((Z27-Z26)/(X27-X26))*(X28-X26))","v":185}]
[]
[null,null,null,null,"Residual ","Static"]
[null,null,null,"Bonnet Setting","Inlet Pressure psig","OUTLET PRESSURES @ FLOW RATE, GPM",null,null,null,null,null,null,null,null,null,null,null,null,null,"Setting # 3: Inlet Pressure",null,null,null,"SETTING 3"]
[null,null,null,null,null,0,50,100,150,175,200,250,300,350,400,450,500,null,null,"Inlet (psig)","Static",null,null,"Inlet (psig)",{"$f":"CONCATENATE(\"Outlet Residual @ \" &AM$8& \" GPM\")","v":"Outlet Residual @ 0 GPM"},{"$f":"CONCATENATE(\"Outlet Residual @ \" &AM$9& \" GPM\")","v":"Outlet Residual @ 0 GPM"},null,null,"Const. PRI Interpolated @ Var. Flow"]
[null,null,null,3,0,0,0,0,0,0,0,0,0,0,0,0,0,null,null,{"$f":"E33","v":0},{"$f":"F33","v":0}]
[null,null,null,null,50,49,44,38,31,32,27,22,18,null,null,null,null,null,null,{"$f":"E34","v":50},49,null,null,{"$f":"E34","v":50},{"$f":"HLOOKUP($AM$8,$F$32:$Q$41,3)","v":49},{"$f":"HLOOKUP($AM$9,$F$32:$Q$41,3)","v":49},"PRI1:",{"$f":"LARGE(X34:X41,COUNTIF(X34:X41,\">\" &AM6)+1)","v":{"$error":"#NUM!"}},{"$f":"VLOOKUP(AB34,X34:Z41,2)","v":{"$error":"#NUM!"}},{"$f":"VLOOKUP(AB34,X34:Z41,3)","v":{"$error":"#NUM!"}},"PRO1:",{"$f":"IF(AM8=AM9, AC34, FORECAST(AM7,$AC$34:$AD$34,$AM$8:$AM$9))","v":{"$error":"#NUM!"}}]
[null,null,null,null,100,72,70,64,60,60,56,50,48,43,38,31,null,null,null,100,72,null,null,{"$f":"E35","v":100},{"$f":"HLOOKUP($AM$8,$F$32:$Q$41,4)","v":72},{"$f":"HLOOKUP($AM$9,$F$32:$Q$41,4)","v":72},"PRI2:",{"$f":"SMALL(X34:X41,COUNTIF(X34:X41,\"<\" &AM6)+1)","v":50},{"$f":"VLOOKUP(AB35,X34:Z41,2)","v":49},{"$f":"VLOOKUP(AB35,X34:Z41,3)","v":49},"PRO2:",{"$f":"IF(AM8=AM9, AC35, FORECAST(AM7,$AC$35:$AD$35,$AM$8:$AM$9))","v":49}]
[null,null,null,null,150,94,88,86,85,83,79,77,75,69,65,62,56,null,null,150,94,null,null,150,{"$f":"HLOOKUP($AM$8,$F$32:$Q$41,5)","v":94},{"$f":"HLOOKUP($AM$9,$F$32:$Q$41,5)","v":94},"PSI1:",{"$f":"LARGE(X34:X41,COUNTIF(X34:X41,\">\" &AM5)+1)","v":{"$error":"#NUM!"}},null,null,"PSO1:",{"$f":"VLOOKUP(AB36,T34:U41,2)","v":{"$error":"#NUM!"}}]
[null,null,null,null,200,115,109,104,102,102,101,100,96,94,89,85,81,null,null,200,115,null,null,200,{"$f":"HLOOKUP($AM$8,$F$32:$Q$41,6)","v":115},{"$f":"HLOOKUP($AM$9,$F$32:$Q$41,6)","v":115},"PSI2:",{"$f":"SMALL(X34:X41,COUNTIF(X34:X41,\"<\" &AM5)+1)","v":50},null,null,"PSO2:",{"$f":"VLOOKUP(AB37,T34:U41,2)","v":49}]
[null,null,null,null,250,134,130,123,123,122,122,120,119,114,112,108,104,null,null,{"$f":"E38","v":250},134,null,null,250,{"$f":"HLOOKUP($AM$8,$F$32:$Q$41,7)","v":134},{"$f":"HLOOKUP($AM$9,$F$32:$Q$41,7)","v":134}]
[null,null,null,null,300,156,149,144,143,142,141,141,139,136,134,131,126,null,null,{"$f":"E39","v":300},{"$f":"F39","v":156},null,null,300,{"$f":"HLOOKUP($AM$8,$F$32:$Q$41,8)","v":156},{"$f":"HLOOKUP($AM$9,$F$32:$Q$41,8)","v":156}]
[null,null,null,null,345,174,166,162,160,159,158,156,156,155,152,150,146,null,null,{"$f":"E40","v":345},174,null,null,345,{"$f":"HLOOKUP($AM$8,$F$32:$Q$41,9)","v":174},{"$f":"HLOOKUP($AM$9,$F$32:$Q$41,9)","v":174}]
[null,null,null,null,null,null,null,null,null,null,null,null,null,null,null,null,null,null,null,400,{"$f":"U39+(((U40-U39)/(T40-T39))*(T41-T39))","v":196},null,null,400,{"$f":"Y39+(((Y40-Y39)/(X40-X39))*(X41-X39))","v":196},{"$f":"Z39+(((Z40-Z39)/(X40-X39))*(X41-X39))","v":196}]
[]
[]
[null,null,null,null,"Residual ","Static"]
[null,null,null,"Bonnet Setting","Inlet Pressure psig","OUTLET PRESSURES @ FLOW RATE, GPM",null,null,null,null,null,null,null,null,null,null,null,null,null,"Setting # 4: Inlet Pressure",null,null,null,"SETTING 4"]
[null,null,null,null,null,0,50,100,150,175,200,250,300,350,400,450,500,null,null,"Inlet (psig)","Static",null,null,"Inlet (psig)",{"$f":"CONCATENATE(\"Outlet Residual @ \" &AM$8& \" GPM\")","v":"Outlet Residual @ 0 GPM"},{"$f":"CONCATENATE(\"Outlet Residual @ \" &AM$9& \" GPM\")","v":"Outlet Residual @ 0 GPM"},null,null,"Const. PRI Interpolated @ Var. Flow"]
[null,null,null,4,0,0,0,0,0,0,0,0,0,0,0,0,0,null,null,{"$f":"E47","v":0},{"$f":"F47","v":0}]
[null,null,null,null,50,50,49,43,39,38,35,27,19,null,null,null,null,null,null,{"$f":"E48","v":50},50,null,null,{"$f":"E48","v":50},{"$f":"HLOOKUP($AM$8,$F$46:$Q$55,3)","v":50},{"$f":"HLOOKUP($AM$9,$F$46:$Q$55,3)","v":50},"PRI1:",{"$f":"LARGE(X48:X55,COUNTIF(X48:X55,\">\" &AM6)+1)","v":{"$error":"#NUM!"}},{"$f":"VLOOKUP(AB48,X48:Z55,2)","v":{"$error":"#NUM!"}},{"$f":"VLOOKUP(AB48,X48:Z55,3)","v":{"$error":"#NUM!"}},"PRO1:",{"$f":"IF(AM8=AM9, AC48, FORECAST(AM7,$AC$48:$AD$48,$AM$8:$AM$9))","v":{"$error":"#NUM!"}}]
[null,null,null,null,100,84,82,79,73,69,66,61,58,52,44,32,null,null,null,100,84,null,null,{"$f":"E49","v":100},{"$f":"HLOOKUP($AM$8,$F$46:$Q$55,4)","v":84},{"$f":"HLOOKUP($AM$9,$F$46:$Q$55,4)","v":84},"PRI2:",{"$f":"SMALL(X48:X55,COUNTIF(X48:X55,\"<\" &AM6)+1)","v":50},{"$f":"VLOOKUP(AB49,X48:Z55,2)","v":50},{"$f":"VLOOKUP(AB49,X48:Z55,3)","v":50},"PRO2:",{"$f":"IF(AM8=AM9, AC49, FORECAST(AM7,$AC$49:$AD$49,$AM$8:$AM$9))","v":50}]
[null,null,null,null,150,106,104,98,98,96,92,88,84,79,77,71,64,null,null,150,106,null,null,150,{"$f":"HLOOKUP($AM$8,$F$46:$Q$55,5)","v":106},{"$f":"HLOOKUP($AM$9,$F$46:$Q$55,5)","v":106},"PSI1:",{"$f":"LARGE(X48:X55,COUNTIF(X48:X55,\">\" &AM5)+1)","v":{"$error":"#NUM!"}},null,null,"PSO1:",{"$f":"VLOOKUP(AB50,T48:U55,2)","v":{"$error":"#NUM!"}}]
[null,null,null,null,200,128,124,118,116,119,115,113,109,104,102,98,91,null,null,200,128,null,null,200,{"$f":"HLOOKUP($AM$8,$F$46:$Q$55,6)","v":128},{"$f":"HLOOKUP($AM$9,$F$46:$Q$55,6)","v":128},"PSI2:",{"$f":"SMALL(X48:X55,COUNTIF(X48:X55,\"<\" &AM5)+1)","v":50},null,null,"PSO2:",{"$f":"VLOOKUP(AB51,T48:U55,2)","v":50}]
[null,null,null,null,250,149,144,137,137,137,134,134,131,128,124,121,118,null,null,{"$f":"E52","v":250},{"$f":"F52","v":149},null,null,250,{"$f":"HLOOKUP($AM$8,$F$46:$Q$55,7)","v":149},{"$f":"HLOOKUP($AM$9,$F$46:$Q$55,7)","v":149}]
[null,null,null,null,300,170,162,157,156,155,156,154,152,149,146,144,140,null,null,{"$f":"E53","v":300},{"$f":"F53","v":170},null,null,300,{"$f":"HLOOKUP($AM$8,$F$46:$Q$55,8)","v":170},{"$f":"HLOOKUP($AM$9,$F$46:$Q$55,8)","v":170}]
[null,null,null,null,310,173,168,162,161,160,158,157,155,150,150,149,144,null,null,310,{"$f":"F54","v":173},null,null,310,{"$f":"HLOOKUP($AM$8,$F$46:$Q$55,9)","v":173},{"$f":"HLOOKUP($AM$9,$F$46:$Q$55,9)","v":173}]
[null,null,null,null,null,null,null,null,null,null,null,null,null,null,null,null,null,null,null,400,{"$f":"U53+(((U54-U53)/(T54-T53))*(T55-T53))","v":200},null,null,400,{"$f":"Y53+(((Y54-Y53)/(X54-X53))*(X55-X53))","v":200},{"$f":"Z53+(((Z54-Z53)/(X54-X53))*(X55-X53))","v":200}]
[]
[]
[null,null,null,null,"Residual ","Static"]
[null,null,null,"Bonnet Setting","Inlet Pressure psig","OUTLET PRESSURES @ FLOW RATE, GPM",null,null,null,null,null,null,null,null,null,null,null,null,null,"Setting # 5: Inlet Pressure",null,null,null,"SETTING 5"]
[null,null,null,null,null,0,50,100,150,175,200,250,300,350,400,450,500,null,null,"Inlet (psig)","Static",null,null,"Inlet (psig)",{"$f":"CONCATENATE(\"Outlet Residual @ \" &AM$8& \" GPM\")","v":"Outlet Residual @ 0 GPM"},{"$f":"CONCATENATE(\"Outlet Residual @ \" &AM$9& \" GPM\")","v":"Outlet Residual @ 0 GPM"},null,null,"Const. PRI Interpolated @ Var. Flow"]
[null,null,null,5,0,0,0,0,0,0,0,0,0,0,0,0,0,null,null,{"$f":"E61","v":0},{"$f":"F61","v":0}]
[null,null,null,null,50,49,48,45,42,38,35,28,19,null,null,null,null,null,null,{"$f":"E62","v":50},{"$f":"F62","v":49},null,null,{"$f":"E62","v":50},{"$f":"HLOOKUP($AM$8,$F$60:$Q$69,3)","v":49},{"$f":"HLOOKUP($AM$9,$F$60:$Q$69,3)","v":49},"PRI1:",{"$f":"LARGE(X62:X69,COUNTIF(X62:X69,\">\" &AM6)+1)","v":{"$error":"#NUM!"}},{"$f":"VLOOKUP(AB62,X62:Z69,2)","v":{"$error":"#NUM!"}},{"$f":"VLOOKUP(AB62,X62:Z69,3)","v":{"$error":"#NUM!"}},"PRO1:",{"$f":"IF(AM8=AM9, AC62, FORECAST(AM7,$AC$62:$AD$62,$AM$8:$AM$9))","v":{"$error":"#NUM!"}}]
[null,null,null,null,100,98,93,87,80,80,75,71,67,57,45,31,null,null,null,100,98,null,null,100,{"$f":"HLOOKUP($AM$8,$F$60:$Q$69,4)","v":98},{"$f":"HLOOKUP($AM$9,$F$60:$Q$69,4)","v":98},"PRI2:",{"$f":"SMALL(X62:X69,COUNTIF(X62:X69,\"<\" &AM6)+1)","v":50},{"$f":"VLOOKUP(AB63,X62:Z69,2)","v":49},{"$f":"VLOOKUP(AB63,X62:Z69,3)","v":49},"PRO2:",{"$f":"IF(AM8=AM9, AC63, FORECAST(AM7,$AC$63:$AD$63,$AM$8:$AM$9))","v":49}]
[null,null,null,null,150,122,118,112,108,108,104,103,95,91,88,80,65,null,null,150,122,null,null,150,{"$f":"HLOOKUP($AM$8,$F$60:$Q$69,5)","v":122},{"$f":"HLOOKUP($AM$9,$F$60:$Q$69,5)","v":122},"PSI1:",{"$f":"LARGE(X62:X69,COUNTIF(X62:X69,\">\" &AM5)+1)","v":{"$error":"#NUM!"}},null,null,"PSO1:",{"$f":"VLOOKUP(AB64,T62:U69,2)","v":{"$error":"#NUM!"}}]
[null,null,null,null,200,143,137,135,133,130,130,125,121,119,115,109,104,null,null,200,143,null,null,200,{"$f":"HLOOKUP($AM$8,$F$60:$Q$69,6)","v":143},{"$f":"HLOOKUP($AM$9,$F$60:$Q$69,6)","v":143},"PSI2:",{"$f":"SMALL(X62:X69,COUNTIF(X62:X69,\"<\" &AM5)+1)","v":50},null,null,"PSO2:",{"$f":"VLOOKUP(AB65,T62:U69,2)","v":49}]
[null,null,null,null,250,163,157,151,149,149,148,147,144,140,137,133,128,null,null,{"$f":"E66","v":250},{"$f":"F66","v":163},null,null,250,{"$f":"HLOOKUP($AM$8,$F$60:$Q$69,7)","v":163},{"$f":"HLOOKUP($AM$9,$F$60:$Q$69,7)","v":163}]
[null,null,null,null,275,174,168,163,160,159,157,155,154,151,148,143,140,null,null,{"$f":"E67","v":275},{"$f":"F67","v":174},null,null,275,{"$f":"HLOOKUP($AM$8,$F$60:$Q$69,8)","v":174},{"$f":"HLOOKUP($AM$9,$F$60:$Q$69,8)","v":174}]
[null,null,null,null,null,null,null,null,null,null,null,null,null,null,null,null,null,null,null,300,{"$f":"U66+(((U67-U66)/(T67-T66))*(T68-T66))","v":185},null,null,300,{"$f":"Y66+(((Y67-Y66)/(X67-X66))*(X68-X66))","v":185},{"$f":"Z66+(((Z67-Z66)/(X67-X66))*(X68-X66))","v":185}]
[null,null,null,null,null,null,null,null,null,null,null,null,null,null,null,null,null,null,null,400,{"$f":"U67+(((U68-U67)/(T68-T67))*(T69-T67))","v":229},null,null,400,{"$f":"Y67+(((Y68-Y67)/(X68-X67))*(X69-X67))","v":229},{"$f":"Z67+(((Z68-Z67)/(X68-X67))*(X69-X67))","v":229}]
[]
[]
[null,null,null,null,"Residual ","Static"]
[null,null,null,"Bonnet Setting","Inlet Pressure psig","OUTLET PRESSURES @ FLOW RATE, GPM",null,null,null,null,null,null,null,null,null,null,null,null,null,"Setting # 6: Inlet Pressure",null,null,null,"SETTING 6"]
[null,null,null,null,null,0,50,100,150,175,200,250,300,350,400,450,500,null,null,"Inlet (psig)","Static",null,null,"Inlet (psig)",{"$f":"CONCATENATE(\"Outlet Residual @ \" &AM$8& \" GPM\")","v":"Outlet Residual @ 0 GPM"},{"$f":"CONCATENATE(\"Outlet Residual @ \" &AM$9& \" GPM\")","v":"Outlet Residual @ 0 GPM"},null,null,"Const. PRI Interpolated @ Var. Flow"]
[null,null,null,6,0,0,0,0,0,0,0,0,0,0,0,0,0,null,null,{"$f":"E75","v":0},{"$f":"F75","v":0}]
[null,null,null,null,50,49,49,47,42,38,36,27,19,null,null,null,null,null,null,{"$f":"E76","v":50},{"$f":"F76","v":49},null,null,{"$f":"E76","v":50},{"$f":"HLOOKUP($AM$8,$F$74:$Q$83,3)","v":49},{"$f":"HLOOKUP($AM$9,$F$74:$Q$83,3)","v":49},"PRI1:",{"$f":"LARGE(X76:X83,COUNTIF(X76:X83,\">\" &AM6)+1)","v":{"$error":"#NUM!"}},{"$f":"VLOOKUP(AB76,X76:Z83,2)","v":{"$error":"#NUM!"}},{"$f":"VLOOKUP(AB76,X76:Z83,3)","v":{"$error":"#NUM!"}},"PRO1:",{"$f":"IF(AM8=AM9, AC76, FORECAST(AM7,$AC$76:$AD$76,$AM$8:$AM$9))","v":{"$error":"#NUM!"}}]
[null,null,null,null,100,100,98,95,91,88,85,77,67,58,45,33,null,null,null,100,100,null,null,{"$f":"E77","v":100},{"$f":"HLOOKUP($AM$8,$F$74:$Q$83,4)","v":100},{"$f":"HLOOKUP($AM$9,$F$74:$Q$83,4)","v":100},"PRI2:",{"$f":"SMALL(X76:X83,COUNTIF(X76:X83,\"<\" &AM6)+1)","v":50},{"$f":"VLOOKUP(AB77,X76:Z83,2)","v":49},{"$f":"VLOOKUP(AB77,X76:Z83,3)","v":49},"PRO2:",{"$f":"IF(AM8=AM9, AC77, FORECAST(AM7,$AC$77:$AD$77,$AM$8:$AM$9))","v":49}]
[null,null,null,null,150,139,136,127,122,121,118,113,110,105,95,81,66,null,null,150,139,null,null,{"$f":"E78","v":150},{"$f":"HLOOKUP($AM$8,$F$74:$Q$83,5)","v":139},{"$f":"HLOOKUP($AM$9,$F$74:$Q$83,5)","v":139},"PSI1:",{"$f":"LARGE(X76:X83,COUNTIF(X76:X83,\">\" &AM5)+1)","v":{"$error":"#NUM!"}},null,null,"PSO1:",{"$f":"VLOOKUP(AB78,T76:U83,2)","v":{"$error":"#NUM!"}}]
[null,null,null,null,200,160,158,150,149,145,144,140,137,131,127,121,117,null,null,200,{"$f":"F79","v":160},null,null,{"$f":"E79","v":200},{"$f":"HLOOKUP($AM$8,$F$74:$Q$83,6)","v":160},{"$f":"HLOOKUP($AM$9,$F$74:$Q$83,6)","v":160},"PSI2:",{"$f":"SMALL(X76:X83,COUNTIF(X76:X83,\"<\" &AM5)+1)","v":50},null,null,"PSO2:",{"$f":"VLOOKUP(AB79,T76:U83,2)","v":49}]
[null,null,null,null,230,174,167,161,160,160,158,154,151,146,142,138,138,null,null,230,174,null,null,{"$f":"E80","v":230},{"$f":"HLOOKUP($AM$8,$F$74:$Q$83,7)","v":174},{"$f":"HLOOKUP($AM$9,$F$74:$Q$83,7)","v":174}]
[null,null,null,null,null,null,null,null,null,null,null,null,null,null,null,null,null,null,null,300,{"$f":"U79+(((U80-U79)/(T80-T79))*(T81-T79))","v":206.66666666666666},null,null,300,{"$f":"Y79+(((Y80-Y79)/(X80-X79))*(X81-X79))","v":206.66666666666666},{"$f":"Z79+(((Z80-Z79)/(X80-X79))*(X81-X79))","v":206.66666666666666}]
[null,null,null,null,null,null,null,null,null,null,null,null,null,null,null,null,null,null,null,350,{"$f":"U80+(((U81-U80)/(T81-T80))*(T82-T80))","v":229.99999999999997},null,null,350,{"$f":"Y80+(((Y81-Y80)/(X81-X80))*(X82-X80))","v":229.99999999999997},{"$f":"Z80+(((Z81-Z80)/(X81-X80))*(X82-X80))","v":229.99999999999997}]
[null,null,null,null,null,null,null,null,null,null,null,null,null,null,null,null,null,null,null,400,{"$f":"U81+(((U82-U81)/(T82-T81))*(T83-T81))","v":253.33333333333329},null,null,400,{"$f":"Y81+(((Y82-Y81)/(X82-X81))*(X83-X81))","v":253.33333333333329},{"$f":"Z81+(((Z82-Z81)/(X82-X81))*(X83-X81))","v":253.33333333333329}]
[]
[]
[null,null,null,null,"Residual ","Static"]
[null,null,null,"Bonnet Setting","Inlet Pressure psig","OUTLET PRESSURES @ FLOW RATE, GPM",null,null,null,null,null,null,null,null,null,null,null,null,null,"Setting # 7: Inlet Pressure",null,null,null,"SETTING 7"]
[null,null,null,null,null,0,50,100,150,175,200,250,300,350,400,450,500,null,null,"Inlet (psig)","Static",null,null,"Inlet (psig)",{"$f":"CONCATENATE(\"Outlet Residual @ \" &AM$8& \" GPM\")","v":"Outlet Residual @ 0 GPM"},{"$f":"CONCATENATE(\"Outlet Residual @ \" &AM$9& \" GPM\")","v":"Outlet Residual @ 0 GPM"},null,null,"Const. PRI Interpolated @ Var. Flow"]
[null,null,null,7,0,0,0,0,0,0,0,0,0,0,0,0,0,null,null,{"$f":"E89","v":0},0]
[null,null,null,null,50,50,49,46,41,40,36,30,23,null,null,null,null,null,null,50,50,null,null,{"$f":"E90","v":50},{"$f":"HLOOKUP($AM$8,$F$88:$Q$96,3)","v":50},{"$f":"HLOOKUP($AM$9,$F$88:$Q$96,3)","v":50},"PRI1:",{"$f":"LARGE(X90:X97,COUNTIF(X90:X97,\">\" &AM6)+1)","v":{"$error":"#NUM!"}},{"$f":"VLOOKUP(AB90,X90:Z97,2)","v":{"$error":"#NUM!"}},{"$f":"VLOOKUP(AB90,X90:Z97,3)","v":{"$error":"#NUM!"}},"PRO1:",{"$f":"IF(AM22=AM23, AC90, FORECAST(AM21,$AC$90:$AD$90,$AM$8:$AM$9))","v":{"$error":"#NUM!"}}]
[null,null,null,null,100,100,99,96,93,89,87,80,74,62,52,40,null,null,null,100,100,null,null,{"$f":"E91","v":100},{"$f":"HLOOKUP($AM$8,$F$88:$Q$96,4)","v":100},{"$f":"HLOOKUP($AM$9,$F$88:$Q$96,4)","v":100},"PRI2:",{"$f":"SMALL(X90:X97,COUNTIF(X90:X97,\"<\" &AM6)+1)","v":50},{"$f":"VLOOKUP(AB91,X90:Z97,2)","v":50},{"$f":"VLOOKUP(AB91,X90:Z97,3)","v":50},"PRO2:",{"$f":"IF(AM22=AM23, AC91, FORECAST(AM21,$AC$91:$AD$91,$AM$8:$AM$9))","v":50}]
[null,null,null,null,150,149,146,134,126,125,123,120,115,111,102,92,79,null,null,150,149,null,null,{"$f":"E92","v":150},{"$f":"HLOOKUP($AM$8,$F$88:$Q$96,5)","v":149},{"$f":"HLOOKUP($AM$9,$F$88:$Q$96,5)","v":149},"PSI1:",{"$f":"LARGE(X90:X97,COUNTIF(X90:X97,\">\" &AM5)+1)","v":{"$error":"#NUM!"}},null,null,"PSO1:",{"$f":"VLOOKUP(AB92,T90:U97,2)","v":{"$error":"#NUM!"}}]
[null,null,null,null,175,174,169,153,142,139,137,134,130,125,120,114,100,null,null,175,{"$f":"F93","v":174},null,null,{"$f":"E93","v":175},{"$f":"HLOOKUP($AM$8,$F$88:$Q$96,6)","v":174},{"$f":"HLOOKUP($AM$9,$F$88:$Q$96,6)","v":174},"PSI2:",{"$f":"SMALL(X90:X97,COUNTIF(X90:X97,\"<\" &AM5)+1)","v":50},null,null,"PSO2:",{"$f":"VLOOKUP(AB93,T90:U97,2)","v":50}]
[null,null,null,null,null,null,null,null,null,null,null,null,null,null,null,null,null,null,null,200,{"$f":"U92+(((U93-U92)/(T93-T92))*(T94-T92))","v":199},null,null,200,{"$f":"Y92+(((Y93-Y92)/(X93-X92))*(X94-X92))","v":199},{"$f":"Z92+(((Z93-Z92)/(X93-X92))*(X94-X92))","v":199}]
[null,null,null,null,null,null,null,null,null,null,null,null,null,null,null,null,null,null,null,250,{"$f":"U93+(((U94-U93)/(T94-T93))*(T95-T93))","v":249},null,null,250,{"$f":"Y93+(((Y94-Y93)/(X94-X93))*(X95-X93))","v":249},{"$f":"Z93+(((Z94-Z93)/(X94-X93))*(X95-X93))","v":249}]
[null,null,null,null,null,null,null,null,null,null,null,null,null,null,null,null,null,null,null,350,{"$f":"U94+(((U95-U94)/(T95-T94))*(T96-T94))","v":349},null,null,350,{"$f":"Y94+(((Y95-Y94)/(X95-X94))*(X96-X94))","v":349},{"$f":"Z94+(((Z95-Z94)/(X95-X94))*(X96-X94))","v":349}]
[null,null,null,null,null,null,null,null,null,null,null,null,null,null,null,null,null,null,null,400,{"$f":"U95+(((U96-U95)/(T96-T95))*(T97-T95))","v":399},null,null,400,{"$f":"Y95+(((Y96-Y95)/(X96-X95))*(X97-X95))","v":399},{"$f":"Z95+(((Z96-Z95)/(X96-X95))*(X97-X95))","v":399}]
[]
[]
[]
[]
[null,null,null,null,null,null,null,null,null,null,null,null,null,null,null,null,null,null,null,null,null,null,null,null,null,null,null,"Pri 2",{"$f":"SMALL(E90:E97,COUNTIF(E90:E97,\"<\" &AM6)+1)","v":50}]
[null,null,null,null,null,null,null,null,null,null,null,null,null,null,null,null,null,null,null,null,null,null,null,400,{"$f":"FORECAST(X103,$Y$92:$Y$93,$X$92:$X$93)","v":399},{"$f":"FORECAST(X103,$Z$92:$Z$93,$X$92:$X$93)","v":399}]
[]
[]
[]
[null,null,null,null,null,null,null,null,null,null,null,null,null,null,null,null,null,null,null,null,null,null,null,200,{"$f":"FORECAST(X107,$Y$90:$Y$93,$X$90:$X$93)","v":198.72881355932205},null,null,50,30]
[null,null,null,null,null,null,null,null,null,null,null,null,null,null,null,null,null,null,null,null,null,null,null,250,{"$f":"FORECAST(X108,$Y$90:$Y$94,$X$90:$X$94)","v":248.44827586206898},null,null,100,80]
[null,null,null,null,null,null,null,null,null,null,null,null,null,null,null,null,null,null,null,null,null,null,null,350,{"$f":"FORECAST(X109,$Y$90:$Y$93,$X$90:$X$93)","v":347.30508474576277},null,"x1",150,120]
[null,null,null,null,null,null,null,null,null,null,null,null,null,null,null,null,null,null,null,null,null,null,null,400,{"$f":"FORECAST(X110,$Y$90:$Y$93,$X$90:$X$93)","v":396.83050847457628},null,"x2",175,134,null,{"$f":"$AC$109+((($AC$110-$AC$109)/($AB$110-$AB$109))*($AB$111-$AB$109))","v":176}]
[null,null,null,null,null,null,null,null,null,null,null,null,null,null,null,null,null,null,null,null,null,null,null,null,null,null,"x",250,{"$f":"$AC$109+((($AC$110-$AC$109)/($AB$110-$AB$109))*($AB$111-$AB$109))","v":176},"y"]
[null,null,null,null,null,null,null,null,null,null,null,null,null,null,null,null,null,null,null,null,null,null,null,null,null,null,null,300,{"$f":"$AC$110+((($AC$111-$AC$110)/($AB$111-$AB$110))*($AB$112-$AB$110))","v":204},null,{"$f":"AB110+(AB111-AB109)/(AB110-AB109)*(AC110-AC109)","v":231}]
[null,null,null,null,null,null,null,null,null,null,null,null,null,null,null,null,null,null,null,null,null,null,null,null,null,null,null,350,{"$f":"$AC$111+((($AC$112-$AC$111)/($AB$112-$AB$111))*($AB$113-$AB$111))","v":232}]
[null,null,null,null,null,null,null,null,null,null,null,null,null,null,null,null,null,null,null,null,null,null,null,null,null,null,null,400,{"$f":"$AC$112+((($AC$113-$AC$112)/($AB$113-$AB$112))*($AB$114-$AB$112))","v":260}]

{"sheet":"IE2600A-250DS-ST","index":7,"n_rows":167,"n_cols":50,"rows_kept":167,"cut":false,"hidden":true,"merged":[[3,45,3,49],[0,0,0,23],[2,1,2,7],[2,10,3,10],[2,11,3,11],[2,12,2,23],[2,26,2,31],[2,34,2,42],[3,34,4,34],[3,35,4,35],[3,36,4,36],[3,39,4,40],[4,10,12,10],[4,45,4,47],[5,45,5,47],[6,45,6,47],[7,45,7,47],[8,45,8,47],[16,34,16,42],[17,34,18,34],[17,35,18,35],[17,36,18,36],[17,39,18,40],[17,45,17,46],[16,1,16,7],[16,10,17,10],[16,11,17,11],[16,12,16,23],[16,26,16,31],[18,10,26,10],[18,45,18,46],[19,45,19,46],[20,45,20,46],[21,45,21,46],[22,45,22,46],[23,45,23,46],[30,34,30,42],[31,34,32,34],[31,35,32,35],[31,36,32,36],[31,39,32,40],[44,12,44,23],[44,26,44,31],[30,1,30,7],[30,10,31,10],[30,11,31,11],[30,12,30,23],[30,26,30,31],[46,10,54,10],[32,10,40,10],[44,1,44,7],[44,10,45,10],[44,11,45,11],[44,34,44,42],[45,34,46,34],[45,35,46,35],[45,36,46,36],[45,39,46,40],[58,34,58,42],[59,34,60,34],[59,35,60,35],[59,36,60,36],[59,39,60,40],[58,1,58,7],[58,10,59,10],[58,11,59,11],[58,12,58,23],[58,26,58,31],[60,10,68,10],[72,1,72,7],[72,10,73,10],[72,11,73,11],[72,12,72,23],[156,1,156,7],[72,34,72,42],[73,34,74,34],[73,35,74,35],[73,36,74,36],[73,39,74,40],[74,10,82,10],[72,26,72,31],[86,1,86,7],[100,1,100,7],[114,1,114,7],[128,1,128,7],[142,1,142,7]]}
["Data from Project# 4788271148, Date: 2018-05-09"]
[]
[null,"STATIC FLOW",null,null,null,null,null,null,null,null,"Bonnet Setting","Inlet Pressure psig","OUTLET PRESSURES @ FLOW RATE, GPM",null,null,null,null,null,null,null,null,null,null,null,null,null,"Setting # 1: Inlet vs. Outlet Pressure Over Flow Range",null,null,null,null,null,null,null,"SETTING 1"]
[null,"Inlet (psig)","Outlet-1 (psig)","Outlet-2 (psig)","Outlet-3 (psig)","Outlet-4 (psig)","Outlet-5 (psig)","Outlet-6 (psig)",null,null,null,null,0,50,100,150,175,200,250,300,350,400,450,500,null,null,"Inlet (psig)","Static","50-200 [GPM]","200-300 [GPM]","300-400 [GPM]","400-500 [GPM]",null,null,"Inlet (psig)",{"$f":"CONCATENATE(\"Outlet Residual @ \" &AX$8& \" GPM\")","v":"Outlet Residual @ 0 GPM"},{"$f":"CONCATENATE(\"Outlet Residual @ \" &AX$9& \" GPM\")","v":"Outlet Residual @ 0 GPM"},null,null,"Const. PRI Interpolated @ Var. Flow",null,null,null,null,null,"VARIABLES"]
[null,0,{"$f":"M5","v":0},{"$f":"M19","v":0},{"$f":"M33","v":0},{"$f":"M47","v":0},{"$f":"M61","v":0},{"$f":"M75","v":0},null,null,1,0,null,null,null,null,null,null,null,null,null,null,null,null,null,null,{"$f":"L5","v":0},null,null,null,null,null,null,null,null,null,null,null,null,null,null,null,null,null,null,"Static Inlet Pressure",null,null,"PSI:",{"$f":"Database!$E$2","v":0}]
[null,50,48,50,52,{"$f":"M48","v":48},{"$f":"M62","v":50},{"$f":"M76","v":50},null,null,null,50,48,47,39,31,27,22,16,null,null,null,null,null,null,null,{"$f":"L6","v":50},{"$f":"M6","v":48},{"$f":"AVERAGE(N6:R6)","v":33.200000000000003},{"$f":"AVERAGE(R6:T6)","v":19},{"$f":"AVERAGE(T6:V6)","v":{"$error":"#DIV/0!"}},{"$f":"AVERAGE(V6:X6)","v":{"$error":"#DIV/0!"}},null,null,{"$f":"L6","v":50},{"$f":"HLOOKUP($AX$8,$M$4:$X$13,3)","v":48},{"$f":"HLOOKUP($AX$9,$M$4:$X$13,3)","v":48},"PRI1:",{"$f":"LARGE(L6:L13,COUNTIF(L6:L13,\">\" &AX6)+1)","v":{"$error":"#NUM!"}},{"$f":"VLOOKUP(AM6,AI6:AK13,2)","v":{"$error":"#NUM!"}},{"$f":"VLOOKUP(AM6,AI6:AK13,3)","v":{"$error":"#NUM!"}},"PRO1:",{"$f":"IF(AX8=AX9, AN6, FORECAST(AX7,$AN$6:$AO$6,$AX$8:$AX$9))","v":{"$error":"#NUM!"}},null,null,"Residual Inlet Pressure",null,null,"PRI:",{"$f":"Database!$E$3","v":0}]
[null,100,82,101,100,{"$f":"M49","v":100},{"$f":"M63","v":98},{"$f":"M77","v":100},null,null,null,100,82,77,69,62,57,55,45,36,25,null,null,null,null,null,100,82,{"$f":"AVERAGE(N7:R7)","v":64},{"$f":"AVERAGE(R7:T7)","v":45.333333333333336},{"$f":"AVERAGE(T7:V7)","v":30.5},{"$f":"AVERAGE(V7:X7)","v":{"$error":"#DIV/0!"}},null,null,{"$f":"L7","v":100},{"$f":"HLOOKUP($AX$8,$M$4:$X$13,4)","v":82},{"$f":"HLOOKUP($AX$9,$M$4:$X$13,4)","v":82},"PRI2:",{"$f":"SMALL(L6:L13,COUNTIF(L6:L13,\"<\" &AX6)+1)","v":50},{"$f":"VLOOKUP(AM7,AI6:AK13,2)","v":48},{"$f":"VLOOKUP(AM7,AI6:AK13,3)","v":48},"PRO2:",{"$f":"IF(AX8=AX9, AN7, FORECAST(AX7,$AN$7:$AO$7,$AX$8:$AX$9))","v":48},null,null,"Flow Rate",null,null,"Q0:",{"$f":"IF(Database!$E$4=500,499.99,Database!$E$4)","v":0}]
[null,150,105,140,150,150,150,150,null,null,null,150,105,101,93,89,83,81,72,62,53,42,28,null,null,null,150,105,89.4,71.666666666666671,52.333333333333336,35,null,null,150,{"$f":"HLOOKUP($AX$8,$M$4:$X$13,5)","v":105},{"$f":"HLOOKUP($AX$9,$M$4:$X$13,5)","v":105},"PSI1:",{"$f":"LARGE(L6:L13,COUNTIF(L6:L13,\">\" &AX5)+1)","v":{"$error":"#NUM!"}},null,null,"PSO1:",{"$f":"VLOOKUP(AM8,L6:M13,2)","v":{"$error":"#NUM!"}},null,null,"Nearest known Flow Rate, 1",null,null,"Q1:",{"$f":"LARGE(M4:X4,COUNTIF(M4:X4,\">\" &AX7)+1)","v":0}]
[null,200,123,168,194,201,200,200,null,null,null,200,123,121,114,110,105,104,98,86,78,68,57,41,null,null,200,123,110.8,96,77.333333333333329,55.333333333333336,null,null,200,{"$f":"HLOOKUP($AX$8,$M$4:$X$13,6)","v":123},{"$f":"HLOOKUP($AX$9,$M$4:$X$13,6)","v":123},"PSI2:",{"$f":"SMALL(L6:L13,COUNTIF(L6:L13,\"<\" &AX5)+1)","v":50},null,null,"PSO2:",{"$f":"VLOOKUP(AM9,L6:M13,2)","v":48},null,null,"Nearest known Flow Rate, 2",null,null,"Q2:",{"$f":"SMALL(M4:X4,COUNTIF(M4:X4,\"<\" &AX7)+1)","v":0}]
[null,250,146,188,215,244,250,250,null,null,null,250,146,138,133,129,126,123,118,109,100,92,83,69,null,null,250,146,129.80000000000001,116.66666666666667,100.33333333333333,81.333333333333329,null,null,250,{"$f":"HLOOKUP($AX$8,$M$4:$X$13,7)","v":146},{"$f":"HLOOKUP($AX$9,$M$4:$X$13,7)","v":146}]
[null,300,173,203,233,266,299,300,null,null,null,300,173,162,155,150,150,142,136,131,122,113,105,94,null,null,300,173,151.80000000000001,136.33333333333334,122,104,null,null,300,{"$f":"HLOOKUP($AX$8,$M$4:$X$13,8)","v":173},{"$f":"HLOOKUP($AX$9,$M$4:$X$13,8)","v":173}]
[null,350,194,229,255,288,319,350,null,null,null,350,194,183,175,173,168,167,155,150,144,135,124,114,null,null,350,194,173.2,157.33333333333334,143,124.33333333333333,null,null,350,{"$f":"HLOOKUP($AX$8,$M$4:$X$13,9)","v":194},{"$f":"HLOOKUP($AX$9,$M$4:$X$13,9)","v":194}]
[null,400,210,248,276,307,341,372,null,null,null,400,210,200,193,192,186,183,177,170,162,157,142,136,null,null,400,210,190.8,176.66666666666666,163,145,null,null,400,{"$f":"HLOOKUP($AX$8,$M$4:$X$13,10)","v":210},{"$f":"HLOOKUP($AX$9,$M$4:$X$13,10)","v":210}]
[]
[]
[]
[null,"50 GPM FLOW RATE",null,null,null,null,null,null,null,null,"Bonnet Setting","Inlet Pressure psig","OUTLET PRESSURES @ FLOW RATE, GPM",null,null,null,null,null,null,null,null,null,null,null,null,null,"Setting # 2: Inlet vs. Outlet Pressure Over Flow Range",null,null,null,null,null,null,null,"SETTING 2"]
[null,"Inlet (psig)","Outlet-1 (psig)","Outlet-2 (psig)","Outlet-3 (psig)","Outlet-4 (psig)","Outlet-5 (psig)","Outlet-6 (psig)",null,null,null,null,0,50,100,150,175,200,250,300,350,400,450,500,null,null,"Inlet (psig)","Static","50-200 [GPM]","200-300 [GPM]","300-400 [GPM]","400-500 [GPM]",null,null,"Inlet (psig)",{"$f":"CONCATENATE(\"Outlet Residual @ \" &AX$8& \" GPM\")","v":"Outlet Residual @ 0 GPM"},{"$f":"CONCATENATE(\"Outlet Residual @ \" &AX$9& \" GPM\")","v":"Outlet Residual @ 0 GPM"},null,null,"Const. PRI Interpolated @ Var. Flow",null,null,null,null,null,"2.5\" Angle Double Spring",null,"Calculated Static Outlet Pressure","Calculated Residual Outlet Pressure","Max Flow Rate"]
[null,0,{"$f":"N5","v":0},{"$f":"N19","v":0},{"$f":"N33","v":0},{"$f":"N47","v":0},{"$f":"N61","v":0},{"$f":"N75","v":0},null,null,2,0,null,null,null,null,null,null,null,null,null,null,null,null,null,null,{"$f":"L19","v":0},null,null,null,null,null,null,null,null,null,null,null,null,null,null,null,null,null,null,"Setting 1",null,{"$f":"IF($AQ$8=$AQ$9,$AQ$8,FORECAST($AX$5,$AQ$8:$AQ$9,$AM$8:$AM$9))","v":{"$error":"#NUM!"}},{"$f":"IF($AQ$6=$AQ$7,$AQ$6,FORECAST($AX$6,$AQ$6:$AQ$7,$AM$6:$AM$7))","v":{"$error":"#NUM!"}},500]
[null,50,47,50,{"$f":"N34","v":47},{"$f":"N48","v":48},{"$f":"N62","v":50},{"$f":"N76","v":50},null,null,null,50,50,50,44,38,34,27,15,null,null,null,null,null,null,null,{"$f":"L20","v":50},{"$f":"M20","v":50},{"$f":"AVERAGE(N20:R20)","v":38.6},{"$f":"AVERAGE(R20:T20)","v":21},{"$f":"AVERAGE(T20:V20)","v":{"$error":"#DIV/0!"}},{"$f":"AVERAGE(V20:X20)","v":{"$error":"#DIV/0!"}},null,null,{"$f":"L20","v":50},{"$f":"HLOOKUP($AX$8,$M$18:$X$27,3)","v":50},{"$f":"HLOOKUP($AX$9,$M$18:$X$27,3)","v":50},"PRI1:",{"$f":"LARGE(L20:L27,COUNTIF(L20:L27,\">\" &AX6)+1)","v":{"$error":"#NUM!"}},{"$f":"VLOOKUP(AM20,AI20:AK27,2)","v":{"$error":"#NUM!"}},{"$f":"VLOOKUP(AM20,AI20:AK27,3)","v":{"$error":"#NUM!"}},"PRO1:",{"$f":"IF(AX8=AX9, AN20, FORECAST(AX7,$AN$20:$AO$20,$AX$8:$AX$9))","v":{"$error":"#NUM!"}},null,null,"Setting 2",null,{"$f":"IF($AQ$22=$AQ$23,$AQ$22,FORECAST($AX$5,$AQ$22:$AQ$23,$AM$22:$AM$23))","v":{"$error":"#NUM!"}},{"$f":"IF($AQ$20=$AQ$21,$AQ$20,FORECAST($AX$6,$AQ$20:$AQ$21,$AM$20:$AM$21))","v":{"$error":"#NUM!"}},500]
[null,100,77,97,{"$f":"N35","v":100},{"$f":"N49","v":100},{"$f":"N63","v":101},{"$f":"N77","v":100},null,null,null,100,101,97,87,80,75,72,62,49,30,null,null,null,null,null,100,101,{"$f":"AVERAGE(N21:R21)","v":82.2},{"$f":"AVERAGE(R21:T21)","v":61},{"$f":"AVERAGE(T21:V21)","v":39.5},{"$f":"AVERAGE(V21:X21)","v":{"$error":"#DIV/0!"}},null,null,{"$f":"L21","v":100},{"$f":"HLOOKUP($AX$8,$M$18:$X$27,4)","v":101},{"$f":"HLOOKUP($AX$9,$M$18:$X$27,4)","v":101},"PRI2:",{"$f":"SMALL(L20:L27,COUNTIF(L20:L27,\"<\" &AX6)+1)","v":50},{"$f":"VLOOKUP(AM21,AI20:AK27,2)","v":50},{"$f":"VLOOKUP(AM21,AI20:AK27,3)","v":50},"PRO2:",{"$f":"IF(AX8=AX9, AN21, FORECAST(AX7,$AN$21:$AO$21,$AX$8:$AX$9))","v":50},null,null,"Setting 3",null,{"$f":"IF($AQ$36=$AQ$37,$AQ$36,FORECAST($AX$5,$AQ$36:$AQ$37,$AM$36:$AM$37))","v":{"$error":"#NUM!"}},{"$f":"IF($AQ$34=$AQ$35,$AQ$34,FORECAST($AX$6,$AQ$34:$AQ$35,$AM$34:$AM$35))","v":{"$error":"#NUM!"}},500]
[null,150,101,129,{"$f":"N36","v":146},150,150,150,null,null,null,150,140,129,118,110,106,102,94,85,76,62,38,null,null,null,150,140,113,93.666666666666671,74.333333333333329,50,null,null,150,{"$f":"HLOOKUP($AX$8,$M$18:$X$27,5)","v":140},{"$f":"HLOOKUP($AX$9,$M$18:$X$27,5)","v":140},"PSI1:",{"$f":"LARGE(L20:L27,COUNTIF(L20:L27,\">\" &AX5)+1)","v":{"$error":"#NUM!"}},null,null,"PSO1:",{"$f":"VLOOKUP(AM22,L20:M27,2)","v":{"$error":"#NUM!"}},null,null,"Setting 4",null,{"$f":"IF($AQ$50=$AQ$51,$AQ$50,FORECAST($AX$5,$AQ$50:$AQ$51,$AM$50:$AM$51))","v":{"$error":"#NUM!"}},{"$f":"IF($AQ$48=$AQ$49,$AQ$48,FORECAST($AX$6,$AQ$48:$AQ$49,$AM$48:$AM$49))","v":{"$error":"#NUM!"}},500]
[null,200,121,151,183,195,200,200,null,null,null,200,168,151,141,139,132,128,120,112,104,92,82,65,null,null,200,168,138.19999999999999,120,102.66666666666667,79.666666666666671,null,null,200,{"$f":"HLOOKUP($AX$8,$M$18:$X$27,6)","v":168},{"$f":"HLOOKUP($AX$9,$M$18:$X$27,6)","v":168},"PSI2:",{"$f":"SMALL(L20:L27,COUNTIF(L20:L27,\"<\" &AX5)+1)","v":50},null,null,"PSO2:",{"$f":"VLOOKUP(AM23,L20:M27,2)","v":50},null,null,"Setting 5",null,{"$f":"IF($AQ$64=$AQ$65,$AQ$64,FORECAST($AX$5,$AQ$64:$AQ$65,$AM$64:$AM$65))","v":{"$error":"#NUM!"}},{"$f":"IF($AQ$62=$AQ$63,$AQ$62,FORECAST($AX$6,$AQ$62:$AQ$63,$AM$62:$AM$63))","v":{"$error":"#NUM!"}},500]
[null,250,138,168,204,230,247,250,null,null,null,250,188,168,162,157,155,151,144,138,129,118,107,97,null,null,250,188,158.6,144.33333333333334,128.33333333333334,107.33333333333333,null,null,250,{"$f":"HLOOKUP($AX$8,$M$18:$X$27,7)","v":188},{"$f":"HLOOKUP($AX$9,$M$18:$X$27,7)","v":188},null,null,null,null,null,null,null,null,"Setting 6",null,{"$f":"IF($AQ$78=$AQ$79,$AQ$78,FORECAST($AX$5,$AQ$78:$AQ$79,$AM$78:$AM$79))","v":{"$error":"#NUM!"}},{"$f":"IF($AQ$76=$AQ$77,$AQ$76,FORECAST($AX$6,$AQ$76:$AQ$77,$AM$76:$AM$77))","v":{"$error":"#NUM!"}},500]
[null,300,162,189,220,256,287,300,null,null,null,300,203,189,183,176,174,172,166,160,151,139,131,120,null,null,300,203,178.8,166,150,130,null,null,300,{"$f":"HLOOKUP($AX$8,$M$18:$X$27,8)","v":203},{"$f":"HLOOKUP($AX$9,$M$18:$X$27,8)","v":203}]
[null,350,183,208,240,276,310,335,null,null,null,350,229,208,201,196,194,191,186,180,171,161,153,141,null,null,350,229,198,185.66666666666666,170.66666666666666,151.66666666666666,null,null,350,{"$f":"HLOOKUP($AX$8,$M$18:$X$27,9)","v":229},{"$f":"HLOOKUP($AX$9,$M$18:$X$27,9)","v":229}]
[null,400,200,227,262,297,333,362,null,null,null,400,248,227,223,217,220,212,205,199,192,185,176,162,null,null,400,248,219.8,205.33333333333334,192,174.33333333333334,null,null,400,{"$f":"HLOOKUP($AX$8,$M$18:$X$27,10)","v":248},{"$f":"HLOOKUP($AX$9,$M$18:$X$27,10)","v":248}]
[]
[]
[]
[null,"100 GPM FLOW RATE",null,null,null,null,null,null,null,null,"Bonnet Setting","Inlet Pressure psig","OUTLET PRESSURES @ FLOW RATE, GPM",null,null,null,null,null,null,null,null,null,null,null,null,null,"Setting # 3: Inlet vs. Outlet Pressure Over Flow Range",null,null,null,null,null,null,null,"SETTING 3"]
[null,"Inlet (psig)","Outlet-1 (psig)","Outlet-2 (psig)","Outlet-3 (psig)","Outlet-4 (psig)","Outlet-5 (psig)","Outlet-6 (psig)",null,null,null,null,0,50,100,150,175,200,250,300,350,400,450,500,null,null,"Inlet (psig)","Static","50-200 [GPM]","200-300 [GPM]","300-400 [GPM]","400-500 [GPM]",null,null,"Inlet (psig)",{"$f":"CONCATENATE(\"Outlet Residual @ \" &AX$8& \" GPM\")","v":"Outlet Residual @ 0 GPM"},{"$f":"CONCATENATE(\"Outlet Residual @ \" &AX$9& \" GPM\")","v":"Outlet Residual @ 0 GPM"},null,null,"Const. PRI Interpolated @ Var. Flow"]
[null,0,{"$f":"O5","v":0},{"$f":"O19","v":0},{"$f":"O33","v":0},{"$f":"O47","v":0},{"$f":"O61","v":0},{"$f":"O75","v":0},null,null,3,0,null,null,null,null,null,null,null,null,null,null,null,null,null,null,{"$f":"L33","v":0}]
[null,50,39,{"$f":"O20","v":44},{"$f":"O34","v":47},{"$f":"O48","v":45},{"$f":"O62","v":44},{"$f":"O76","v":42},null,null,null,50,52,47,47,38,32,27,14,null,null,null,null,null,null,null,{"$f":"L34","v":50},{"$f":"M34","v":52},{"$f":"AVERAGE(N34:R34)","v":38.200000000000003},{"$f":"AVERAGE(R34:T34)","v":20.5},{"$f":"AVERAGE(T34:V34)","v":{"$error":"#DIV/0!"}},{"$f":"AVERAGE(V34:X34)","v":{"$error":"#DIV/0!"}},null,null,{"$f":"L34","v":50},{"$f":"HLOOKUP($AX$8,$M$32:$X$41,3)","v":52},{"$f":"HLOOKUP($AX$9,$M$32:$X$41,3)","v":52},"PRI1:",{"$f":"LARGE(L34:L41,COUNTIF(L34:L41,\">\" &AX6)+1)","v":{"$error":"#NUM!"}},{"$f":"VLOOKUP(AM34,AI34:AK41,2)","v":{"$error":"#NUM!"}},{"$f":"VLOOKUP(AM34,AI34:AK41,3)","v":{"$error":"#NUM!"}},"PRO1:",{"$f":"IF(AX8=AX9, AN34, FORECAST(AX7,$AN$34:$AO$34,$AX$8:$AX$9))","v":{"$error":"#NUM!"}}]
[null,100,69,{"$f":"O21","v":87},{"$f":"O35","v":94},{"$f":"O49","v":96},{"$f":"O63","v":95},{"$f":"O77","v":93},null,null,null,100,100,100,94,88,84,79,67,51,31,null,null,null,null,null,100,100,{"$f":"AVERAGE(N35:R35)","v":89},{"$f":"AVERAGE(R35:T35)","v":65.666666666666671},{"$f":"AVERAGE(T35:V35)","v":41},{"$f":"AVERAGE(V35:X35)","v":{"$error":"#DIV/0!"}},null,null,{"$f":"L35","v":100},{"$f":"HLOOKUP($AX$8,$M$32:$X$41,4)","v":100},{"$f":"HLOOKUP($AX$9,$M$32:$X$41,4)","v":100},"PRI2:",{"$f":"SMALL(L34:L41,COUNTIF(L34:L41,\"<\" &AX6)+1)","v":50},{"$f":"VLOOKUP(AM35,AI34:AK41,2)","v":52},{"$f":"VLOOKUP(AM35,AI34:AK41,3)","v":52},"PRO2:",{"$f":"IF(AX8=AX9, AN35, FORECAST(AX7,$AN$35:$AO$35,$AX$8:$AX$9))","v":52}]
[null,150,93,{"$f":"O22","v":118},{"$f":"O36","v":140},145,145,144,null,null,null,150,150,146,140,130,127,123,115,102,86,63,38,null,null,null,150,150,133.19999999999999,113.33333333333333,83.666666666666671,50.5,null,null,150,{"$f":"HLOOKUP($AX$8,$M$32:$X$41,5)","v":150},{"$f":"HLOOKUP($AX$9,$M$32:$X$41,5)","v":150},"PSI1:",{"$f":"LARGE(L34:L41,COUNTIF(L34:L41,\">\" &AX5)+1)","v":{"$error":"#NUM!"}},null,null,"PSO1:",{"$f":"VLOOKUP(AM36,L34:M41,2)","v":{"$error":"#NUM!"}}]
[null,200,114,141,169,189,196,196,null,null,null,200,194,183,169,165,157,156,147,137,127,113,88,65,null,null,200,194,166,146.66666666666666,125.66666666666667,88.666666666666671,null,null,200,{"$f":"HLOOKUP($AX$8,$M$32:$X$41,6)","v":194},{"$f":"HLOOKUP($AX$9,$M$32:$X$41,6)","v":194},"PSI2:",{"$f":"SMALL(L34:L41,COUNTIF(L34:L41,\"<\" &AX5)+1)","v":50},null,null,"PSO2:",{"$f":"VLOOKUP(AM37,L34:M41,2)","v":52}]
[null,250,133,162,200,224,241,245,null,null,null,250,215,204,200,191,187,183,176,165,156,145,134,114,null,null,250,215,193,174.66666666666666,155.33333333333334,131,null,null,250,{"$f":"HLOOKUP($AX$8,$M$32:$X$41,7)","v":215},{"$f":"HLOOKUP($AX$9,$M$32:$X$41,7)","v":215}]
[null,300,155,183,214,249,279,289,null,null,null,300,233,220,214,209,205,203,194,186,180,171,161,147,null,null,300,233,210.2,194.33333333333334,179,159.66666666666666,null,null,300,{"$f":"HLOOKUP($AX$8,$M$32:$X$41,8)","v":233},{"$f":"HLOOKUP($AX$9,$M$32:$X$41,8)","v":233}]
[null,350,175,201,233,266,304,326,null,null,null,350,255,240,233,227,227,224,217,210,201,195,187,173,null,null,350,255,230.2,217,202,185,null,null,350,{"$f":"HLOOKUP($AX$8,$M$32:$X$41,9)","v":255},{"$f":"HLOOKUP($AX$9,$M$32:$X$41,9)","v":255}]
[null,400,193,223,254,288,320,348,null,null,null,400,276,262,254,249,246,242,237,230,224,214,204,192,null,null,400,276,250.6,236.33333333333334,222.66666666666666,203.33333333333334,null,null,400,{"$f":"HLOOKUP($AX$8,$M$32:$X$41,10)","v":276},{"$f":"HLOOKUP($AX$9,$M$32:$X$41,10)","v":276}]
[]
[]
[]
[null,"150 GPM FLOW RATE",null,null,null,null,null,null,null,null,"Bonnet Setting","Inlet Pressure psig","OUTLET PRESSURES @ FLOW RATE, GPM",null,null,null,null,null,null,null,null,null,null,null,null,null,"Setting # 4: Inlet vs. Outlet Pressure Over Flow Range",null,null,null,null,null,null,null,"SETTING 4"]
[null,"Inlet (psig)","Outlet-1 (psig)","Outlet-2 (psig)","Outlet-3 (psig)","Outlet-4 (psig)","Outlet-5 (psig)","Outlet-6 (psig)",null,null,null,null,0,50,100,150,175,200,250,300,350,400,450,500,null,null,"Inlet (psig)","Static","50-200 [GPM]","200-300 [GPM]","300-400 [GPM]","400-500 [GPM]",null,null,"Inlet (psig)",{"$f":"CONCATENATE(\"Outlet Residual @ \" &AX$8& \" GPM\")","v":"Outlet Residual @ 0 GPM"},{"$f":"CONCATENATE(\"Outlet Residual @ \" &AX$9& \" GPM\")","v":"Outlet Residual @ 0 GPM"},null,null,"Const. PRI Interpolated @ Var. Flow"]
[null,0,{"$f":"P5","v":0},{"$f":"P19","v":0},{"$f":"P33","v":0},{"$f":"P47","v":0},{"$f":"P61","v":0},{"$f":"P75","v":0},null,null,4,0,null,null,null,null,null,null,null,null,null,null,null,null,null,null,{"$f":"L47","v":0}]
[null,50,31,{"$f":"P20","v":38},{"$f":"P34","v":38},{"$f":"P48","v":38},{"$f":"P62","v":38},{"$f":"P76","v":40},null,null,null,50,48,48,45,38,33,28,15,null,null,null,null,null,null,null,{"$f":"L48","v":50},{"$f":"M48","v":48},{"$f":"AVERAGE(N48:R48)","v":38.4},{"$f":"AVERAGE(R48:T48)","v":21.5},{"$f":"AVERAGE(T48:V48)","v":{"$error":"#DIV/0!"}},{"$f":"AVERAGE(V48:X48)","v":{"$error":"#DIV/0!"}},null,null,{"$f":"L48","v":50},{"$f":"HLOOKUP($AX$8,$M$46:$X$55,3)","v":48},{"$f":"HLOOKUP($AX$9,$M$46:$X$55,3)","v":48},"PRI1:",{"$f":"LARGE(L48:L55,COUNTIF(L48:L55,\">\" &AX6)+1)","v":{"$error":"#NUM!"}},{"$f":"VLOOKUP(AM48,AI48:AK55,2)","v":{"$error":"#NUM!"}},{"$f":"VLOOKUP(AM48,AI48:AK55,3)","v":{"$error":"#NUM!"}},"PRO1:",{"$f":"IF(AX8=AX9, AN48, FORECAST(AX7,$AN$48:$AO$48,$AX$8:$AX$9))","v":{"$error":"#NUM!"}}]
[null,100,62,{"$f":"P21","v":80},{"$f":"P35","v":88},{"$f":"P49","v":88},{"$f":"P63","v":88},{"$f":"P77","v":87},null,null,null,100,100,100,96,88,84,80,68,50,33,null,null,null,null,null,100,100,{"$f":"AVERAGE(N49:R49)","v":89.6},{"$f":"AVERAGE(R49:T49)","v":66},{"$f":"AVERAGE(T49:V49)","v":41.5},{"$f":"AVERAGE(V49:X49)","v":{"$error":"#DIV/0!"}},null,null,{"$f":"L49","v":100},{"$f":"HLOOKUP($AX$8,$M$46:$X$55,4)","v":100},{"$f":"HLOOKUP($AX$9,$M$46:$X$55,4)","v":100},"PRI2:",{"$f":"SMALL(L48:L55,COUNTIF(L48:L55,\"<\" &AX6)+1)","v":50},{"$f":"VLOOKUP(AM49,AI48:AK55,2)","v":48},{"$f":"VLOOKUP(AM49,AI48:AK55,3)","v":48},"PRO2:",{"$f":"IF(AX8=AX9, AN49, FORECAST(AX7,$AN$49:$AO$49,$AX$8:$AX$9))","v":48}]
[null,150,89,{"$f":"P22","v":110},130,138,138,138,null,null,null,150,150,150,145,138,135,129,116,100,85,64,38,null,null,null,150,150,139.4,115,83,51,null,null,150,{"$f":"HLOOKUP($AX$8,$M$46:$X$55,5)","v":150},{"$f":"HLOOKUP($AX$9,$M$46:$X$55,5)","v":150},"PSI1:",{"$f":"LARGE(L48:L55,COUNTIF(L48:L55,\">\" &AX5)+1)","v":{"$error":"#NUM!"}},null,null,"PSO1:",{"$f":"VLOOKUP(AM50,L48:M55,2)","v":{"$error":"#NUM!"}}]
[null,200,110,139,165,182,188,187,null,null,null,200,201,195,189,182,180,173,164,151,134,113,88,63,null,null,200,201,183.8,162.66666666666666,132.66666666666666,88,null,null,200,{"$f":"HLOOKUP($AX$8,$M$46:$X$55,6)","v":201},{"$f":"HLOOKUP($AX$9,$M$46:$X$55,6)","v":201},"PSI2:",{"$f":"SMALL(L48:L55,COUNTIF(L48:L55,\"<\" &AX5)+1)","v":50},null,null,"PSO2:",{"$f":"VLOOKUP(AM51,L48:M55,2)","v":48}]
[null,250,129,157,191,214,233,239,null,null,null,250,244,230,224,214,211,204,196,187,176,162,139,112,null,null,250,244,216.6,195.66666666666666,175,137.66666666666666,null,null,250,{"$f":"HLOOKUP($AX$8,$M$46:$X$55,7)","v":244},{"$f":"HLOOKUP($AX$9,$M$46:$X$55,7)","v":244}]
[null,300,150,176,209,241,265,280,null,null,null,300,266,256,249,241,235,232,223,218,207,193,183,163,null,null,300,266,242.6,224.33333333333334,206,179.66666666666666,null,null,300,{"$f":"HLOOKUP($AX$8,$M$46:$X$55,8)","v":266},{"$f":"HLOOKUP($AX$9,$M$46:$X$55,8)","v":266}]
[null,350,173,196,227,266,294,316,null,null,null,350,288,276,266,266,258,256,250,240,229,220,210,197,null,null,350,288,264.39999999999998,248.66666666666666,229.66666666666666,209,null,null,350,{"$f":"HLOOKUP($AX$8,$M$46:$X$55,9)","v":288},{"$f":"HLOOKUP($AX$9,$M$46:$X$55,9)","v":288}]
[null,400,192,217,249,283,314,341,null,null,null,400,307,297,288,283,278,278,266,260,253,247,235,222,null,null,400,307,284.8,268,253.33333333333334,234.66666666666666,null,null,400,{"$f":"HLOOKUP($AX$8,$M$46:$X$55,10)","v":307},{"$f":"HLOOKUP($AX$9,$M$46:$X$55,10)","v":307}]
[]
[]
[]
[null,"175 GPM FLOW RATE",null,null,null,null,null,null,null,null,"Bonnet Setting","Inlet Pressure psig","OUTLET PRESSURES @ FLOW RATE, GPM",null,null,null,null,null,null,null,null,null,null,null,null,null,"Setting # 5: Inlet vs. Outlet Pressure Over Flow Range",null,null,null,null,null,null,null,"SETTING 5"]
[null,"Inlet (psig)","Outlet-1 (psig)","Outlet-2 (psig)","Outlet-3 (psig)","Outlet-4 (psig)","Outlet-5 (psig)","Outlet-6 (psig)",null,null,null,null,0,50,100,150,175,200,250,300,350,400,450,500,null,null,"Inlet (psig)","Static","50-200 [GPM]","200-300 [GPM]","300-400 [GPM]","400-500 [GPM]",null,null,"Inlet (psig)",{"$f":"CONCATENATE(\"Outlet Residual @ \" &AX$8& \" GPM\")","v":"Outlet Residual @ 0 GPM"},{"$f":"CONCATENATE(\"Outlet Residual @ \" &AX$9& \" GPM\")","v":"Outlet Residual @ 0 GPM"},null,null,"Const. PRI Interpolated @ Var. Flow"]
[null,0,{"$f":"Q5","v":0},{"$f":"Q19","v":0},{"$f":"Q33","v":0},{"$f":"Q47","v":0},{"$f":"Q61","v":0},{"$f":"Q75","v":0},null,null,5,0,null,null,null,null,null,null,null,null,null,null,null,null,null,null,{"$f":"L61","v":0}]
[null,50,{"$f":"Q6","v":27},{"$f":"Q20","v":34},{"$f":"Q34","v":32},{"$f":"Q48","v":33},{"$f":"Q62","v":33},{"$f":"Q76","v":33},null,null,null,50,50,50,44,38,33,26,12,null,null,null,null,null,null,null,{"$f":"L62","v":50},{"$f":"M62","v":50},{"$f":"AVERAGE(N62:R62)","v":38.200000000000003},{"$f":"AVERAGE(R62:T62)","v":19},{"$f":"AVERAGE(T62:V62)","v":{"$error":"#DIV/0!"}},{"$f":"AVERAGE(V62:X62)","v":{"$error":"#DIV/0!"}},null,null,{"$f":"L62","v":50},{"$f":"HLOOKUP($AX$8,$M$60:$X$69,3)","v":50},{"$f":"HLOOKUP($AX$9,$M$60:$X$69,3)","v":50},"PRI1:",{"$f":"LARGE(L62:L69,COUNTIF(L62:L69,\">\" &AX6)+1)","v":{"$error":"#NUM!"}},{"$f":"VLOOKUP(AM62,AI62:AK69,2)","v":{"$error":"#NUM!"}},{"$f":"VLOOKUP(AM62,AI62:AK69,3)","v":{"$error":"#NUM!"}},"PRO1:",{"$f":"IF(AX8=AX9, AN62, FORECAST(AX7,$AN$62:$AO$62,$AX$8:$AX$9))","v":{"$error":"#NUM!"}}]
[null,100,{"$f":"Q7","v":57},{"$f":"Q21","v":75},{"$f":"Q35","v":84},{"$f":"Q49","v":84},{"$f":"Q63","v":84},{"$f":"Q77","v":84},null,null,null,100,98,101,95,88,84,79,65,50,32,null,null,null,null,null,100,98,{"$f":"AVERAGE(N63:R63)","v":89.4},{"$f":"AVERAGE(R63:T63)","v":64.666666666666671},{"$f":"AVERAGE(T63:V63)","v":41},{"$f":"AVERAGE(V63:X63)","v":{"$error":"#DIV/0!"}},null,null,{"$f":"L63","v":100},{"$f":"HLOOKUP($AX$8,$M$60:$X$69,4)","v":98},{"$f":"HLOOKUP($AX$9,$M$60:$X$69,4)","v":98},"PRI2:",{"$f":"SMALL(L62:L69,COUNTIF(L62:L69,\"<\" &AX6)+1)","v":50},{"$f":"VLOOKUP(AM63,AI62:AK69,2)","v":50},{"$f":"VLOOKUP(AM63,AI62:AK69,3)","v":50},"PRO2:",{"$f":"IF(AX8=AX9, AN63, FORECAST(AX7,$AN$63:$AO$63,$AX$8:$AX$9))","v":50}]
[null,150,{"$f":"Q8","v":83},{"$f":"Q22","v":106},127,135,133,135,null,null,null,150,150,150,145,138,133,129,116,100,86,64,36,null,null,null,150,150,139,115,83.333333333333329,50,null,null,150,{"$f":"HLOOKUP($AX$8,$M$60:$X$69,5)","v":150},{"$f":"HLOOKUP($AX$9,$M$60:$X$69,5)","v":150},"PSI1:",{"$f":"LARGE(L62:L69,COUNTIF(L62:L69,\">\" &AX5)+1)","v":{"$error":"#NUM!"}},null,null,"PSO1:",{"$f":"VLOOKUP(AM64,L62:M69,2)","v":{"$error":"#NUM!"}}]
[null,200,105,132,157,180,184,184,null,null,null,200,200,200,196,188,184,178,167,149,133,113,90,63,null,null,200,200,189.2,164.66666666666666,131.66666666666666,88.666666666666671,null,null,200,{"$f":"HLOOKUP($AX$8,$M$60:$X$69,6)","v":200},{"$f":"HLOOKUP($AX$9,$M$60:$X$69,6)","v":200},"PSI2:",{"$f":"SMALL(L62:L69,COUNTIF(L62:L69,\"<\" &AX5)+1)","v":50},null,null,"PSO2:",{"$f":"VLOOKUP(AM65,L62:M69,2)","v":50}]
[null,250,126,155,187,211,229,233,null,null,null,250,250,247,241,233,229,224,215,202,183,163,140,114,null,null,250,250,234.8,213.66666666666666,182.66666666666666,139,null,null,250,{"$f":"HLOOKUP($AX$8,$M$60:$X$69,7)","v":250},{"$f":"HLOOKUP($AX$9,$M$60:$X$69,7)","v":250}]
[null,300,150,174,205,235,261,277,null,null,null,300,299,287,279,265,261,258,249,240,227,212,191,163,null,null,300,299,270,249,226.33333333333334,188.66666666666666,null,null,300,{"$f":"HLOOKUP($AX$8,$M$60:$X$69,8)","v":299},{"$f":"HLOOKUP($AX$9,$M$60:$X$69,8)","v":299}]
[null,350,168,194,227,258,289,312,null,null,null,350,319,310,304,294,289,286,276,270,255,249,236,216,null,null,350,319,296.60000000000002,277.33333333333331,258,233.66666666666666,null,null,350,{"$f":"HLOOKUP($AX$8,$M$60:$X$69,9)","v":319},{"$f":"HLOOKUP($AX$9,$M$60:$X$69,9)","v":319}]
[null,400,186,220,246,278,311,337,null,null,null,400,341,333,320,314,311,306,299,293,284,274,262,251,null,null,400,341,316.8,299.33333333333331,283.66666666666669,262.33333333333331,null,null,400,{"$f":"HLOOKUP($AX$8,$M$60:$X$69,10)","v":341},{"$f":"HLOOKUP($AX$9,$M$60:$X$69,10)","v":341}]
[]
[]
[]
[null,"200 GPM FLOW RATE",null,null,null,null,null,null,null,null,"Bonnet Setting","Inlet Pressure psig","OUTLET PRESSURES @ FLOW RATE, GPM",null,null,null,null,null,null,null,null,null,null,null,null,null,"Setting # 6: Inlet vs. Outlet Pressure Over Flow Range",null,null,null,null,null,null,null,"SETTING 6"]
[null,"Inlet (psig)","Outlet-1 (psig)","Outlet-2 (psig)","Outlet-3 (psig)","Outlet-4 (psig)","Outlet-5 (psig)","Outlet-6 (psig)",null,null,null,null,0,50,100,150,175,200,250,300,350,400,450,500,null,null,"Inlet (psig)","Static","50-200 [GPM]","200-300 [GPM]","300-400 [GPM]","400-500 [GPM]",null,null,"Inlet (psig)",{"$f":"CONCATENATE(\"Outlet Residual @ \" &AX$8& \" GPM\")","v":"Outlet Residual @ 0 GPM"},{"$f":"CONCATENATE(\"Outlet Residual @ \" &AX$9& \" GPM\")","v":"Outlet Residual @ 0 GPM"},null,null,"Const. PRI Interpolated @ Var. Flow"]
[null,0,{"$f":"R5","v":0},{"$f":"R19","v":0},{"$f":"R33","v":0},{"$f":"R47","v":0},{"$f":"R61","v":0},{"$f":"R75","v":0},null,null,6,0,null,null,null,null,null,null,null,null,null,null,null,null,null,null,{"$f":"L75","v":0}]
[null,50,22,{"$f":"R20","v":27},{"$f":"R34","v":27},{"$f":"R48","v":28},{"$f":"R62","v":26},{"$f":"R76","v":24},null,null,null,50,50,50,42,40,33,24,18,null,null,null,null,null,null,null,{"$f":"L76","v":50},{"$f":"M76","v":50},{"$f":"AVERAGE(N76:R76)","v":37.799999999999997},{"$f":"AVERAGE(R76:T76)","v":21},{"$f":"AVERAGE(T76:V76)","v":{"$error":"#DIV/0!"}},{"$f":"AVERAGE(V76:X76)","v":{"$error":"#DIV/0!"}},null,null,{"$f":"L76","v":50},{"$f":"HLOOKUP($AX$8,$M$74:$X$83,3)","v":50},{"$f":"HLOOKUP($AX$9,$M$74:$X$83,3)","v":50},"PRI1:",{"$f":"LARGE(L76:L83,COUNTIF(L76:L83,\">\" &AX6)+1)","v":{"$error":"#NUM!"}},{"$f":"VLOOKUP(AM76,AI76:AK83,2)","v":{"$error":"#NUM!"}},{"$f":"VLOOKUP(AM76,AI76:AK83,3)","v":{"$error":"#NUM!"}},"PRO1:",{"$f":"IF(AX8=AX9, AN76, FORECAST(AX7,$AN$76:$AO$76,$AX$8:$AX$9))","v":{"$error":"#NUM!"}}]
[null,100,55,{"$f":"R21","v":72},{"$f":"R35","v":79},{"$f":"R49","v":80},{"$f":"R63","v":79},{"$f":"R77","v":79},null,null,null,100,100,100,93,87,84,79,67,50,35,null,null,null,null,null,100,100,{"$f":"AVERAGE(N77:R77)","v":88.6},{"$f":"AVERAGE(R77:T77)","v":65.333333333333329},{"$f":"AVERAGE(T77:V77)","v":42.5},{"$f":"AVERAGE(V77:X77)","v":{"$error":"#DIV/0!"}},null,null,{"$f":"L77","v":100},{"$f":"HLOOKUP($AX$8,$M$74:$X$83,4)","v":100},{"$f":"HLOOKUP($AX$9,$M$74:$X$83,4)","v":100},"PRI2:",{"$f":"SMALL(L76:L83,COUNTIF(L76:L83,\"<\" &AX6)+1)","v":50},{"$f":"VLOOKUP(AM77,AI76:AK83,2)","v":50},{"$f":"VLOOKUP(AM77,AI76:AK83,3)","v":50},"PRO2:",{"$f":"IF(AX8=AX9, AN77, FORECAST(AX7,$AN$77:$AO$77,$AX$8:$AX$9))","v":50}]
[null,150,81,{"$f":"R22","v":102},123,129,129,129,null,null,null,150,150,150,144,138,135,129,117,102,84,66,39,null,null,null,150,150,139.19999999999999,116,84,52.5,null,null,150,{"$f":"HLOOKUP($AX$8,$M$74:$X$83,5)","v":150},{"$f":"HLOOKUP($AX$9,$M$74:$X$83,5)","v":150},"PSI1:",{"$f":"LARGE(L76:L83,COUNTIF(L76:L83,\">\" &AX5)+1)","v":{"$error":"#NUM!"}},null,null,"PSO1:",{"$f":"VLOOKUP(AM78,L76:M83,2)","v":{"$error":"#NUM!"}}]
[null,200,104,128,156,173,178,179,null,null,null,200,200,200,196,187,184,179,166,154,134,113,90,65,null,null,200,200,189.2,166.33333333333334,133.66666666666666,89.333333333333329,null,null,200,{"$f":"HLOOKUP($AX$8,$M$74:$X$83,6)","v":200},{"$f":"HLOOKUP($AX$9,$M$74:$X$83,6)","v":200},"PSI2:",{"$f":"SMALL(L76:L83,COUNTIF(L76:L83,\"<\" &AX5)+1)","v":50},null,null,"PSO2:",{"$f":"VLOOKUP(AM79,L76:M83,2)","v":50}]
[null,250,123,151,183,204,224,228,null,null,null,250,250,250,245,239,233,228,217,199,183,164,144,115,null,null,250,250,239,214.66666666666666,182,141,null,null,250,{"$f":"HLOOKUP($AX$8,$M$74:$X$83,7)","v":250},{"$f":"HLOOKUP($AX$9,$M$74:$X$83,7)","v":250}]
[null,300,142,172,203,232,258,271,null,null,null,300,300,300,289,280,277,271,264,249,233,213,192,163,null,null,300,300,283.39999999999998,261.33333333333331,231.66666666666666,189.33333333333334,null,null,300,{"$f":"HLOOKUP($AX$8,$M$74:$X$83,8)","v":300},{"$f":"HLOOKUP($AX$9,$M$74:$X$83,8)","v":300}]
[null,350,167,191,224,256,286,305,null,null,null,350,350,335,326,316,312,305,295,286,277,263,240,217,null,null,350,350,318.8,295.33333333333331,275.33333333333331,240,null,null,350,{"$f":"HLOOKUP($AX$8,$M$74:$X$83,9)","v":350},{"$f":"HLOOKUP($AX$9,$M$74:$X$83,9)","v":350}]
[null,400,183,212,242,278,306,332,null,null,null,400,372,362,348,341,337,332,322,318,304,294,281,261,null,null,400,372,344,324,305.33333333333331,278.66666666666669,null,null,400,{"$f":"HLOOKUP($AX$8,$M$74:$X$83,10)","v":372},{"$f":"HLOOKUP($AX$9,$M$74:$X$83,10)","v":372}]
[]
[]
[]
[null,"250 GPM FLOW RATE"]
[null,"Inlet (psig)","Outlet-1 (psig)","Outlet-2 (psig)","Outlet-3 (psig)","Outlet-4 (psig)","Outlet-5 (psig)","Outlet-6 (psig)"]
[null,0,{"$f":"S5","v":0},{"$f":"S19","v":0},{"$f":"S33","v":0},{"$f":"S47","v":0},{"$f":"S61","v":0},{"$f":"S75","v":0}]
[null,50,{"$f":"S6","v":16},{"$f":"S20","v":15},{"$f":"S34","v":14},{"$f":"S48","v":15},{"$f":"S62","v":12},{"$f":"S76","v":18}]
[null,100,{"$f":"S7","v":45},{"$f":"S21","v":62},{"$f":"S35","v":67},{"$f":"S49","v":68},{"$f":"S63","v":65},{"$f":"S77","v":67}]
[null,150,{"$f":"S8","v":72},{"$f":"S22","v":94},115,116,116,117]
[null,200,98,120,147,164,167,166]
[null,250,118,144,176,196,215,217]
[null,300,136,166,194,223,249,264]
[null,350,155,186,217,250,276,295]
[null,400,177,205,237,266,299,322]
[]
[]
[]
[null,"300 GPM FLOW RATE"]
[null,"Inlet (psig)","Outlet-1 (psig)","Outlet-2 (psig)","Outlet-3 (psig)","Outlet-4 (psig)","Outlet-5 (psig)","Outlet-6 (psig)"]
[null,0,{"$f":"T5","v":0},{"$f":"T19","v":0},{"$f":"T33","v":0},{"$f":"T47","v":0},{"$f":"T61","v":0},{"$f":"T75","v":0}]
[null,50,0,0,{"$f":"T34","v":0},{"$f":"T48","v":0},{"$f":"T62","v":0},{"$f":"T76","v":0}]
[null,100,36,49,{"$f":"T35","v":51},{"$f":"T49","v":50},{"$f":"T63","v":50},{"$f":"T77","v":50}]
[null,150,62,85,{"$f":"T36","v":102},{"$f":"T50","v":100},{"$f":"T64","v":100},{"$f":"T78","v":102}]
[null,200,86,112,137,151,149,154]
[null,250,109,138,165,187,202,199]
[null,300,131,160,186,218,240,249]
[null,350,150,180,210,240,270,286]
[null,400,170,199,230,260,293,318]
[]
[]
[]
[null,"350 GPM FLOW RATE"]
[null,"Inlet (psig)","Outlet-1 (psig)","Outlet-2 (psig)","Outlet-3 (psig)","Outlet-4 (psig)","Outlet-5 (psig)","Outlet-6 (psig)"]
[null,0,{"$f":"U5","v":0},{"$f":"U19","v":0},{"$f":"U33","v":0},{"$f":"U47","v":0},{"$f":"U61","v":0},{"$f":"U75","v":0}]
[null,50,0,0,{"$f":"U34","v":0},{"$f":"U48","v":0},{"$f":"U62","v":0},{"$f":"U76","v":0}]
[null,100,25,30,{"$f":"U35","v":31},{"$f":"U49","v":33},{"$f":"U63","v":32},{"$f":"U77","v":35}]
[null,150,53,76,{"$f":"U36","v":86},{"$f":"U50","v":85},{"$f":"U64","v":86},{"$f":"U78","v":84}]
[null,200,78,104,127,134,133,134]
[null,250,100,129,156,176,183,183]
[null,300,122,151,180,207,227,233]
[null,350,144,171,201,229,255,277]
[null,400,162,192,224,253,284,304]
[]
[]
[]
[null,"400 GPM FLOW RATE"]
[null,"Inlet (psig)","Outlet-1 (psig)","Outlet-2 (psig)","Outlet-3 (psig)","Outlet-4 (psig)","Outlet-5 (psig)","Outlet-6 (psig)"]
[null,0,{"$f":"V5","v":0},{"$f":"V19","v":0},{"$f":"V33","v":0},{"$f":"V47","v":0},{"$f":"V61","v":0},{"$f":"V75","v":0}]
[null,50,0,0,0,0,0,0]
[null,100,0,0,0,0,0,0]
[null,150,42,62,63,64,64,66]
[null,200,68,92,113,113,113,113]
[null,250,92,118,145,162,163,164]
[null,300,113,139,171,193,212,213]
[null,350,135,161,195,220,249,263]
[null,400,157,185,214,247,274,294]
[]
[]
[]
[null,"450 GPM FLOW RATE"]
[null,"Inlet (psig)","Outlet-1 (psig)","Outlet-2 (psig)","Outlet-3 (psig)","Outlet-4 (psig)","Outlet-5 (psig)","Outlet-6 (psig)"]
[null,0,{"$f":"W5","v":0},{"$f":"W19","v":0},{"$f":"W33","v":0},{"$f":"W47","v":0},{"$f":"W61","v":0},{"$f":"W75","v":0}]
[null,50,0,0,0,0,0,0]
[null,100,0,0,0,0,0,0]
[null,150,28,38,38,38,36,39]
[null,200,57,82,88,88,90,90]
[null,250,83,107,134,139,140,144]
[null,300,105,131,161,183,191,192]
[null,350,124,153,187,210,236,240]
[null,400,142,176,204,235,262,281]
[]
[]
[]
[null,"500 GPM FLOW RATE"]
[null,"Inlet (psig)","Outlet-1 (psig)","Outlet-2 (psig)","Outlet-3 (psig)","Outlet-4 (psig)","Outlet-5 (psig)","Outlet-6 (psig)"]
[null,0,{"$f":"X5","v":0},{"$f":"X19","v":0},{"$f":"X33","v":0},{"$f":"X47","v":0},{"$f":"X61","v":0},{"$f":"X75","v":0}]
[null,50,0,0,0,0,0,0]
[null,100,0,0,0,0,0,0]
[null,150,0,0,0,0,0,0]
[null,200,41,65,65,63,63,65]
[null,250,69,97,114,112,114,115]
[null,300,94,120,147,163,163,163]
[null,350,114,141,173,197,216,217]
[null,400,136,162,192,222,251,261]

{"sheet":"IE2600A-250OS-ST","index":8,"n_rows":167,"n_cols":50,"rows_kept":167,"cut":false,"hidden":true,"merged":[[156,1,156,7],[72,34,72,42],[73,34,74,34],[73,35,74,35],[73,36,74,36],[73,39,74,40],[74,10,82,10],[72,26,72,31],[86,1,86,7],[100,1,100,7],[114,1,114,7],[128,1,128,7],[142,1,142,7],[60,10,68,10],[72,1,72,7],[72,10,73,10],[72,11,73,11],[72,12,72,23],[58,1,58,7],[58,10,59,10],[58,11,59,11],[58,12,58,23],[58,26,58,31],[58,34,58,42],[59,34,60,34],[59,35,60,35],[59,36,60,36],[59,39,60,40],[44,34,44,42],[45,34,46,34],[45,35,46,35],[45,36,46,36],[45,39,46,40],[46,10,54,10],[32,10,40,10],[44,1,44,7],[44,10,45,10],[44,11,45,11],[44,12,44,23],[44,26,44,31],[30,1,30,7],[30,10,31,10],[30,11,31,11],[30,12,30,23],[30,26,30,31],[30,34,30,42],[31,34,32,34],[31,35,32,35],[31,36,32,36],[31,39,32,40],[18,10,26,10],[18,45,18,46],[19,45,19,46],[20,45,20,46],[21,45,21,46],[22,45,22,46],[23,45,23,46],[16,1,16,7],[16,10,17,10],[16,11,17,11],[16,12,16,23],[16,26,16,31],[7,45,7,47],[8,45,8,47],[16,34,16,42],[17,34,18,34],[17,35,18,35],[17,36,18,36],[17,39,18,40],[17,45,17,46],[3,45,3,49],[0,0,0,23],[2,1,2,7],[2,10,3,10],[2,11,3,11],[2,12,2,23],[2,26,2,31],[2,34,2,42],[3,34,4,34],[3,35,4,35],[3,36,4,36],[3,39,4,40],[4,10,12,10],[4,45,4,47],[5,45,5,47],[6,45,6,47]]}
["Data from Project# 4788271148, Date: 2018-05-09"]
[]
[null,"STATIC FLOW",null,null,null,null,null,null,null,null,"Bonnet Setting","Inlet Pressure psig","OUTLET PRESSURES @ FLOW RATE, GPM",null,null,null,null,null,null,null,null,null,null,null,null,null,"Setting # 1: Inlet vs. Outlet Pressure Over Flow Range",null,null,null,null,null,null,null,"SETTING 1"]
[null,"Inlet (psig)","Outlet-1 (psig)","Outlet-2 (psig)","Outlet-3 (psig)","Outlet-4 (psig)","Outlet-5 (psig)","Outlet-6 (psig)",null,null,null,null,0,50,100,150,175,200,250,300,350,400,450,500,null,null,"Inlet (psig)","Static","50-200 [GPM]","200-300 [GPM]","300-400 [GPM]","400-500 [GPM]",null,null,"Inlet (psig)",{"$f":"CONCATENATE(\"Outlet Residual @ \" &AX$8& \" GPM\")","v":"Outlet Residual @ 0 GPM"},{"$f":"CONCATENATE(\"Outlet Residual @ \" &AX$9& \" GPM\")","v":"Outlet Residual @ 0 GPM"},null,null,"Const. PRI Interpolated @ Var. Flow",null,null,null,null,null,"VARIABLES"]
[null,0,{"$f":"M5","v":0},{"$f":"M19","v":0},{"$f":"M33","v":0},{"$f":"M47","v":0},{"$f":"M61","v":0},{"$f":"M75","v":0},null,null,1,0,null,null,null,null,null,null,null,null,null,null,null,null,null,null,{"$f":"L5","v":0},null,null,null,null,null,null,null,null,null,null,null,null,null,null,null,null,null,null,"Static Inlet Pressure",null,null,"PSI:",{"$f":"Database!$E$2","v":0}]
[null,50,48,50,52,{"$f":"M48","v":48},{"$f":"M62","v":50},{"$f":"M76","v":50},null,null,null,50,48,47,39,31,27,22,16,null,null,null,null,null,null,null,{"$f":"L6","v":50},{"$f":"M6","v":48},{"$f":"AVERAGE(N6:R6)","v":33.200000000000003},{"$f":"AVERAGE(R6:T6)","v":19},{"$f":"AVERAGE(T6:V6)","v":{"$error":"#DIV/0!"}},{"$f":"AVERAGE(V6:X6)","v":{"$error":"#DIV/0!"}},null,null,{"$f":"L6","v":50},{"$f":"HLOOKUP($AX$8,$M$4:$X$13,3)","v":48},{"$f":"HLOOKUP($AX$9,$M$4:$X$13,3)","v":48},"PRI1:",{"$f":"LARGE(L6:L13,COUNTIF(L6:L13,\">\" &AX6)+1)","v":{"$error":"#NUM!"}},{"$f":"VLOOKUP(AM6,AI6:AK13,2)","v":{"$error":"#NUM!"}},{"$f":"VLOOKUP(AM6,AI6:AK13,3)","v":{"$error":"#NUM!"}},"PRO1:",{"$f":"IF(AX8=AX9, AN6, FORECAST(AX7,$AN$6:$AO$6,$AX$8:$AX$9))","v":{"$error":"#NUM!"}},null,null,"Residual Inlet Pressure",null,null,"PRI:",{"$f":"Database!$E$3","v":0}]
[null,100,82,101,100,{"$f":"M49","v":100},{"$f":"M63","v":98},{"$f":"M77","v":100},null,null,null,100,82,77,69,62,57,55,45,36,25,null,null,null,null,null,100,82,{"$f":"AVERAGE(N7:R7)","v":64},{"$f":"AVERAGE(R7:T7)","v":45.333333333333336},{"$f":"AVERAGE(T7:V7)","v":30.5},{"$f":"AVERAGE(V7:X7)","v":{"$error":"#DIV/0!"}},null,null,{"$f":"L7","v":100},{"$f":"HLOOKUP($AX$8,$M$4:$X$13,4)","v":82},{"$f":"HLOOKUP($AX$9,$M$4:$X$13,4)","v":82},"PRI2:",{"$f":"SMALL(L6:L13,COUNTIF(L6:L13,\"<\" &AX6)+1)","v":50},{"$f":"VLOOKUP(AM7,AI6:AK13,2)","v":48},{"$f":"VLOOKUP(AM7,AI6:AK13,3)","v":48},"PRO2:",{"$f":"IF(AX8=AX9, AN7, FORECAST(AX7,$AN$7:$AO$7,$AX$8:$AX$9))","v":48},null,null,"Flow Rate",null,null,"Q0:",{"$f":"IF(Database!$E$4=500,499.99,Database!$E$4)","v":0}]
[null,150,105,140,150,150,150,150,null,null,null,150,105,101,93,89,83,81,72,62,53,42,28,null,null,null,150,105,89.4,71.666666666666671,52.333333333333336,35,null,null,150,{"$f":"HLOOKUP($AX$8,$M$4:$X$13,5)","v":105},{"$f":"HLOOKUP($AX$9,$M$4:$X$13,5)","v":105},"PSI1:",{"$f":"LARGE(L6:L13,COUNTIF(L6:L13,\">\" &AX5)+1)","v":{"$error":"#NUM!"}},null,null,"PSO1:",{"$f":"VLOOKUP(AM8,L6:M13,2)","v":{"$error":"#NUM!"}},null,null,"Nearest known Flow Rate, 1",null,null,"Q1:",{"$f":"LARGE(M4:X4,COUNTIF(M4:X4,\">\" &AX7)+1)","v":0}]
[null,200,123,168,194,201,200,200,null,null,null,200,123,121,114,110,105,104,98,86,78,68,57,41,null,null,200,123,110.8,96,77.333333333333329,55.333333333333336,null,null,200,{"$f":"HLOOKUP($AX$8,$M$4:$X$13,6)","v":123},{"$f":"HLOOKUP($AX$9,$M$4:$X$13,6)","v":123},"PSI2:",{"$f":"SMALL(L6:L13,COUNTIF(L6:L13,\"<\" &AX5)+1)","v":50},null,null,"PSO2:",{"$f":"VLOOKUP(AM9,L6:M13,2)","v":48},null,null,"Nearest known Flow Rate, 2",null,null,"Q2:",{"$f":"SMALL(M4:X4,COUNTIF(M4:X4,\"<\" &AX7)+1)","v":0}]
[null,250,146,188,215,244,250,250,null,null,null,250,146,138,133,129,126,123,118,109,100,92,83,69,null,null,250,146,129.80000000000001,116.66666666666667,100.33333333333333,81.333333333333329,null,null,250,{"$f":"HLOOKUP($AX$8,$M$4:$X$13,7)","v":146},{"$f":"HLOOKUP($AX$9,$M$4:$X$13,7)","v":146}]
[null,300,173,203,233,266,299,300,null,null,null,300,173,162,155,150,150,142,136,131,122,113,105,94,null,null,300,173,151.80000000000001,136.33333333333334,122,104,null,null,300,{"$f":"HLOOKUP($AX$8,$M$4:$X$13,8)","v":173},{"$f":"HLOOKUP($AX$9,$M$4:$X$13,8)","v":173}]
[null,350,194,229,255,288,319,350,null,null,null,350,194,183,175,173,168,167,155,150,144,135,124,114,null,null,350,194,173.2,157.33333333333334,143,124.33333333333333,null,null,350,{"$f":"HLOOKUP($AX$8,$M$4:$X$13,9)","v":194},{"$f":"HLOOKUP($AX$9,$M$4:$X$13,9)","v":194}]
[null,400,210,248,276,307,341,372,null,null,null,400,210,200,193,192,186,183,177,170,162,157,142,136,null,null,400,210,190.8,176.66666666666666,163,145,null,null,400,{"$f":"HLOOKUP($AX$8,$M$4:$X$13,10)","v":210},{"$f":"HLOOKUP($AX$9,$M$4:$X$13,10)","v":210}]
[]
[]
[]
[null,"50 GPM FLOW RATE",null,null,null,null,null,null,null,null,"Bonnet Setting","Inlet Pressure psig","OUTLET PRESSURES @ FLOW RATE, GPM",null,null,null,null,null,null,null,null,null,null,null,null,null,"Setting # 2: Inlet vs. Outlet Pressure Over Flow Range",null,null,null,null,null,null,null,"SETTING 2"]
[null,"Inlet (psig)","Outlet-1 (psig)","Outlet-2 (psig)","Outlet-3 (psig)","Outlet-4 (psig)","Outlet-5 (psig)","Outlet-6 (psig)",null,null,null,null,0,50,100,150,175,200,250,300,350,400,450,500,null,null,"Inlet (psig)","Static","50-200 [GPM]","200-300 [GPM]","300-400 [GPM]","400-500 [GPM]",null,null,"Inlet (psig)",{"$f":"CONCATENATE(\"Outlet Residual @ \" &AX$8& \" GPM\")","v":"Outlet Residual @ 0 GPM"},{"$f":"CONCATENATE(\"Outlet Residual @ \" &AX$9& \" GPM\")","v":"Outlet Residual @ 0 GPM"},null,null,"Const. PRI Interpolated @ Var. Flow",null,null,null,null,null,"2.5\" Angle Double Spring",null,"Calculated Static Outlet Pressure","Calculated Residual Outlet Pressure","Max Flow Rate"]
[null,0,{"$f":"N5","v":0},{"$f":"N19","v":0},{"$f":"N33","v":0},{"$f":"N47","v":0},{"$f":"N61","v":0},{"$f":"N75","v":0},null,null,2,0,null,null,null,null,null,null,null,null,null,null,null,null,null,null,{"$f":"L19","v":0},null,null,null,null,null,null,null,null,null,null,null,null,null,null,null,null,null,null,"Setting 1",null,{"$f":"IF($AQ$8=$AQ$9,$AQ$8,FORECAST($AX$5,$AQ$8:$AQ$9,$AM$8:$AM$9))","v":{"$error":"#NUM!"}},{"$f":"IF($AQ$6=$AQ$7,$AQ$6,FORECAST($AX$6,$AQ$6:$AQ$7,$AM$6:$AM$7))","v":{"$error":"#NUM!"}},500]
[null,50,47,50,{"$f":"N34","v":47},{"$f":"N48","v":48},{"$f":"N62","v":50},{"$f":"N76","v":50},null,null,null,50,50,50,44,38,34,27,15,null,null,null,null,null,null,null,{"$f":"L20","v":50},{"$f":"M20","v":50},{"$f":"AVERAGE(N20:R20)","v":38.6},{"$f":"AVERAGE(R20:T20)","v":21},{"$f":"AVERAGE(T20:V20)","v":{"$error":"#DIV/0!"}},{"$f":"AVERAGE(V20:X20)","v":{"$error":"#DIV/0!"}},null,null,{"$f":"L20","v":50},{"$f":"HLOOKUP($AX$8,$M$18:$X$27,3)","v":50},{"$f":"HLOOKUP($AX$9,$M$18:$X$27,3)","v":50},"PRI1:",{"$f":"LARGE(L20:L27,COUNTIF(L20:L27,\">\" &AX6)+1)","v":{"$error":"#NUM!"}},{"$f":"VLOOKUP(AM20,AI20:AK27,2)","v":{"$error":"#NUM!"}},{"$f":"VLOOKUP(AM20,AI20:AK27,3)","v":{"$error":"#NUM!"}},"PRO1:",{"$f":"IF(AX8=AX9, AN20, FORECAST(AX7,$AN$20:$AO$20,$AX$8:$AX$9))","v":{"$error":"#NUM!"}},null,null,"Setting 2",null,{"$f":"IF($AQ$22=$AQ$23,$AQ$22,FORECAST($AX$5,$AQ$22:$AQ$23,$AM$22:$AM$23))","v":{"$error":"#NUM!"}},{"$f":"IF($AQ$20=$AQ$21,$AQ$20,FORECAST($AX$6,$AQ$20:$AQ$21,$AM$20:$AM$21))","v":{"$error":"#NUM!"}},500]
[null,100,77,97,{"$f":"N35","v":100},{"$f":"N49","v":100},{"$f":"N63","v":101},{"$f":"N77","v":100},null,null,null,100,101,97,87,80,75,72,62,49,30,null,null,null,null,null,100,101,{"$f":"AVERAGE(N21:R21)","v":82.2},{"$f":"AVERAGE(R21:T21)","v":61},{"$f":"AVERAGE(T21:V21)","v":39.5},{"$f":"AVERAGE(V21:X21)","v":{"$error":"#DIV/0!"}},null,null,{"$f":"L21","v":100},{"$f":"HLOOKUP($AX$8,$M$18:$X$27,4)","v":101},{"$f":"HLOOKUP($AX$9,$M$18:$X$27,4)","v":101},"PRI2:",{"$f":"SMALL(L20:L27,COUNTIF(L20:L27,\"<\" &AX6)+1)","v":50},{"$f":"VLOOKUP(AM21,AI20:AK27,2)","v":50},{"$f":"VLOOKUP(AM21,AI20:AK27,3)","v":50},"PRO2:",{"$f":"IF(AX8=AX9, AN21, FORECAST(AX7,$AN$21:$AO$21,$AX$8:$AX$9))","v":50},null,null,"Setting 3",null,{"$f":"IF($AQ$36=$AQ$37,$AQ$36,FORECAST($AX$5,$AQ$36:$AQ$37,$AM$36:$AM$37))","v":{"$error":"#NUM!"}},{"$f":"IF($AQ$34=$AQ$35,$AQ$34,FORECAST($AX$6,$AQ$34:$AQ$35,$AM$34:$AM$35))","v":{"$error":"#NUM!"}},500]
[null,150,101,129,{"$f":"N36","v":146},150,150,150,null,null,null,150,140,129,118,110,106,102,94,85,76,62,38,null,null,null,150,140,113,93.666666666666671,74.333333333333329,50,null,null,150,{"$f":"HLOOKUP($AX$8,$M$18:$X$27,5)","v":140},{"$f":"HLOOKUP($AX$9,$M$18:$X$27,5)","v":140},"PSI1:",{"$f":"LARGE(L20:L27,COUNTIF(L20:L27,\">\" &AX5)+1)","v":{"$error":"#NUM!"}},null,null,"PSO1:",{"$f":"VLOOKUP(AM22,L20:M27,2)","v":{"$error":"#NUM!"}},null,null,"Setting 4",null,{"$f":"IF($AQ$50=$AQ$51,$AQ$50,FORECAST($AX$5,$AQ$50:$AQ$51,$AM$50:$AM$51))","v":{"$error":"#NUM!"}},{"$f":"IF($AQ$48=$AQ$49,$AQ$48,FORECAST($AX$6,$AQ$48:$AQ$49,$AM$48:$AM$49))","v":{"$error":"#NUM!"}},500]
[null,200,121,151,183,195,200,200,null,null,null,200,168,151,141,139,132,128,120,112,104,92,82,65,null,null,200,168,138.19999999999999,120,102.66666666666667,79.666666666666671,null,null,200,{"$f":"HLOOKUP($AX$8,$M$18:$X$27,6)","v":168},{"$f":"HLOOKUP($AX$9,$M$18:$X$27,6)","v":168},"PSI2:",{"$f":"SMALL(L20:L27,COUNTIF(L20:L27,\"<\" &AX5)+1)","v":50},null,null,"PSO2:",{"$f":"VLOOKUP(AM23,L20:M27,2)","v":50},null,null,"Setting 5",null,{"$f":"IF($AQ$64=$AQ$65,$AQ$64,FORECAST($AX$5,$AQ$64:$AQ$65,$AM$64:$AM$65))","v":{"$error":"#NUM!"}},{"$f":"IF($AQ$62=$AQ$63,$AQ$62,FORECAST($AX$6,$AQ$62:$AQ$63,$AM$62:$AM$63))","v":{"$error":"#NUM!"}},500]
[null,250,138,168,204,230,247,250,null,null,null,250,188,168,162,157,155,151,144,138,129,118,107,97,null,null,250,188,158.6,144.33333333333334,128.33333333333334,107.33333333333333,null,null,250,{"$f":"HLOOKUP($AX$8,$M$18:$X$27,7)","v":188},{"$f":"HLOOKUP($AX$9,$M$18:$X$27,7)","v":188},null,null,null,null,null,null,null,null,"Setting 6",null,{"$f":"IF($AQ$78=$AQ$79,$AQ$78,FORECAST($AX$5,$AQ$78:$AQ$79,$AM$78:$AM$79))","v":{"$error":"#NUM!"}},{"$f":"IF($AQ$76=$AQ$77,$AQ$76,FORECAST($AX$6,$AQ$76:$AQ$77,$AM$76:$AM$77))","v":{"$error":"#NUM!"}},500]
[null,300,162,189,220,256,287,300,null,null,null,300,203,189,183,176,174,172,166,160,151,139,131,120,null,null,300,203,178.8,166,150,130,null,null,300,{"$f":"HLOOKUP($AX$8,$M$18:$X$27,8)","v":203},{"$f":"HLOOKUP($AX$9,$M$18:$X$27,8)","v":203}]
[null,350,183,208,240,276,310,335,null,null,null,350,229,208,201,196,194,191,186,180,171,161,153,141,null,null,350,229,198,185.66666666666666,170.66666666666666,151.66666666666666,null,null,350,{"$f":"HLOOKUP($AX$8,$M$18:$X$27,9)","v":229},{"$f":"HLOOKUP($AX$9,$M$18:$X$27,9)","v":229}]
[null,400,200,227,262,297,333,362,null,null,null,400,248,227,223,217,220,212,205,199,192,185,176,162,null,null,400,248,219.8,205.33333333333334,192,174.33333333333334,null,null,400,{"$f":"HLOOKUP($AX$8,$M$18:$X$27,10)","v":248},{"$f":"HLOOKUP($AX$9,$M$18:$X$27,10)","v":248}]
[]
[]
[]
[null,"100 GPM FLOW RATE",null,null,null,null,null,null,null,null,"Bonnet Setting","Inlet Pressure psig","OUTLET PRESSURES @ FLOW RATE, GPM",null,null,null,null,null,null,null,null,null,null,null,null,null,"Setting # 3: Inlet vs. Outlet Pressure Over Flow Range",null,null,null,null,null,null,null,"SETTING 3"]
[null,"Inlet (psig)","Outlet-1 (psig)","Outlet-2 (psig)","Outlet-3 (psig)","Outlet-4 (psig)","Outlet-5 (psig)","Outlet-6 (psig)",null,null,null,null,0,50,100,150,175,200,250,300,350,400,450,500,null,null,"Inlet (psig)","Static","50-200 [GPM]","200-300 [GPM]","300-400 [GPM]","400-500 [GPM]",null,null,"Inlet (psig)",{"$f":"CONCATENATE(\"Outlet Residual @ \" &AX$8& \" GPM\")","v":"Outlet Residual @ 0 GPM"},{"$f":"CONCATENATE(\"Outlet Residual @ \" &AX$9& \" GPM\")","v":"Outlet Residual @ 0 GPM"},null,null,"Const. PRI Interpolated @ Var. Flow"]
[null,0,{"$f":"O5","v":0},{"$f":"O19","v":0},{"$f":"O33","v":0},{"$f":"O47","v":0},{"$f":"O61","v":0},{"$f":"O75","v":0},null,null,3,0,null,null,null,null,null,null,null,null,null,null,null,null,null,null,{"$f":"L33","v":0}]
[null,50,39,{"$f":"O20","v":44},{"$f":"O34","v":47},{"$f":"O48","v":45},{"$f":"O62","v":44},{"$f":"O76","v":42},null,null,null,50,52,47,47,38,32,27,14,null,null,null,null,null,null,null,{"$f":"L34","v":50},{"$f":"M34","v":52},{"$f":"AVERAGE(N34:R34)","v":38.200000000000003},{"$f":"AVERAGE(R34:T34)","v":20.5},{"$f":"AVERAGE(T34:V34)","v":{"$error":"#DIV/0!"}},{"$f":"AVERAGE(V34:X34)","v":{"$error":"#DIV/0!"}},null,null,{"$f":"L34","v":50},{"$f":"HLOOKUP($AX$8,$M$32:$X$41,3)","v":52},{"$f":"HLOOKUP($AX$9,$M$32:$X$41,3)","v":52},"PRI1:",{"$f":"LARGE(L34:L41,COUNTIF(L34:L41,\">\" &AX6)+1)","v":{"$error":"#NUM!"}},{"$f":"VLOOKUP(AM34,AI34:AK41,2)","v":{"$error":"#NUM!"}},{"$f":"VLOOKUP(AM34,AI34:AK41,3)","v":{"$error":"#NUM!"}},"PRO1:",{"$f":"IF(AX8=AX9, AN34, FORECAST(AX7,$AN$34:$AO$34,$AX$8:$AX$9))","v":{"$error":"#NUM!"}}]
[null,100,69,{"$f":"O21","v":87},{"$f":"O35","v":94},{"$f":"O49","v":96},{"$f":"O63","v":95},{"$f":"O77","v":93},null,null,null,100,100,100,94,88,84,79,67,51,31,null,null,null,null,null,100,100,{"$f":"AVERAGE(N35:R35)","v":89},{"$f":"AVERAGE(R35:T35)","v":65.666666666666671},{"$f":"AVERAGE(T35:V35)","v":41},{"$f":"AVERAGE(V35:X35)","v":{"$error":"#DIV/0!"}},null,null,{"$f":"L35","v":100},{"$f":"HLOOKUP($AX$8,$M$32:$X$41,4)","v":100},{"$f":"HLOOKUP($AX$9,$M$32:$X$41,4)","v":100},"PRI2:",{"$f":"SMALL(L34:L41,COUNTIF(L34:L41,\"<\" &AX6)+1)","v":50},{"$f":"VLOOKUP(AM35,AI34:AK41,2)","v":52},{"$f":"VLOOKUP(AM35,AI34:AK41,3)","v":52},"PRO2:",{"$f":"IF(AX8=AX9, AN35, FORECAST(AX7,$AN$35:$AO$35,$AX$8:$AX$9))","v":52}]
[null,150,93,{"$f":"O22","v":118},{"$f":"O36","v":140},145,145,144,null,null,null,150,150,146,140,130,127,123,115,102,86,63,38,null,null,null,150,150,133.19999999999999,113.33333333333333,83.666666666666671,50.5,null,null,150,{"$f":"HLOOKUP($AX$8,$M$32:$X$41,5)","v":150},{"$f":"HLOOKUP($AX$9,$M$32:$X$41,5)","v":150},"PSI1:",{"$f":"LARGE(L34:L41,COUNTIF(L34:L41,\">\" &AX5)+1)","v":{"$error":"#NUM!"}},null,null,"PSO1:",{"$f":"VLOOKUP(AM36,L34:M41,2)","v":{"$error":"#NUM!"}}]
[null,200,114,141,169,189,196,196,null,null,null,200,194,183,169,165,157,156,147,137,127,113,88,65,null,null,200,194,166,146.66666666666666,125.66666666666667,88.666666666666671,null,null,200,{"$f":"HLOOKUP($AX$8,$M$32:$X$41,6)","v":194},{"$f":"HLOOKUP($AX$9,$M$32:$X$41,6)","v":194},"PSI2:",{"$f":"SMALL(L34:L41,COUNTIF(L34:L41,\"<\" &AX5)+1)","v":50},null,null,"PSO2:",{"$f":"VLOOKUP(AM37,L34:M41,2)","v":52}]
[null,250,133,162,200,224,241,245,null,null,null,250,215,204,200,191,187,183,176,165,156,145,134,114,null,null,250,215,193,174.66666666666666,155.33333333333334,131,null,null,250,{"$f":"HLOOKUP($AX$8,$M$32:$X$41,7)","v":215},{"$f":"HLOOKUP($AX$9,$M$32:$X$41,7)","v":215}]
[null,300,155,183,214,249,279,289,null,null,null,300,233,220,214,209,205,203,194,186,180,171,161,147,null,null,300,233,210.2,194.33333333333334,179,159.66666666666666,null,null,300,{"$f":"HLOOKUP($AX$8,$M$32:$X$41,8)","v":233},{"$f":"HLOOKUP($AX$9,$M$32:$X$41,8)","v":233}]
[null,350,175,201,233,266,304,326,null,null,null,350,255,240,233,227,227,224,217,210,201,195,187,173,null,null,350,255,230.2,217,202,185,null,null,350,{"$f":"HLOOKUP($AX$8,$M$32:$X$41,9)","v":255},{"$f":"HLOOKUP($AX$9,$M$32:$X$41,9)","v":255}]
[null,400,193,223,254,288,320,348,null,null,null,400,276,262,254,249,246,242,237,230,224,214,204,192,null,null,400,276,250.6,236.33333333333334,222.66666666666666,203.33333333333334,null,null,400,{"$f":"HLOOKUP($AX$8,$M$32:$X$41,10)","v":276},{"$f":"HLOOKUP($AX$9,$M$32:$X$41,10)","v":276}]
[]
[]
[]
[null,"150 GPM FLOW RATE",null,null,null,null,null,null,null,null,"Bonnet Setting","Inlet Pressure psig","OUTLET PRESSURES @ FLOW RATE, GPM",null,null,null,null,null,null,null,null,null,null,null,null,null,"Setting # 4: Inlet vs. Outlet Pressure Over Flow Range",null,null,null,null,null,null,null,"SETTING 4"]
[null,"Inlet (psig)","Outlet-1 (psig)","Outlet-2 (psig)","Outlet-3 (psig)","Outlet-4 (psig)","Outlet-5 (psig)","Outlet-6 (psig)",null,null,null,null,0,50,100,150,175,200,250,300,350,400,450,500,null,null,"Inlet (psig)","Static","50-200 [GPM]","200-300 [GPM]","300-400 [GPM]","400-500 [GPM]",null,null,"Inlet (psig)",{"$f":"CONCATENATE(\"Outlet Residual @ \" &AX$8& \" GPM\")","v":"Outlet Residual @ 0 GPM"},{"$f":"CONCATENATE(\"Outlet Residual @ \" &AX$9& \" GPM\")","v":"Outlet Residual @ 0 GPM"},null,null,"Const. PRI Interpolated @ Var. Flow"]
[null,0,{"$f":"P5","v":0},{"$f":"P19","v":0},{"$f":"P33","v":0},{"$f":"P47","v":0},{"$f":"P61","v":0},{"$f":"P75","v":0},null,null,4,0,null,null,null,null,null,null,null,null,null,null,null,null,null,null,{"$f":"L47","v":0}]
[null,50,31,{"$f":"P20","v":38},{"$f":"P34","v":38},{"$f":"P48","v":38},{"$f":"P62","v":38},{"$f":"P76","v":40},null,null,null,50,48,48,45,38,33,28,15,null,null,null,null,null,null,null,{"$f":"L48","v":50},{"$f":"M48","v":48},{"$f":"AVERAGE(N48:R48)","v":38.4},{"$f":"AVERAGE(R48:T48)","v":21.5},{"$f":"AVERAGE(T48:V48)","v":{"$error":"#DIV/0!"}},{"$f":"AVERAGE(V48:X48)","v":{"$error":"#DIV/0!"}},null,null,{"$f":"L48","v":50},{"$f":"HLOOKUP($AX$8,$M$46:$X$55,3)","v":48},{"$f":"HLOOKUP($AX$9,$M$46:$X$55,3)","v":48},"PRI1:",{"$f":"LARGE(L48:L55,COUNTIF(L48:L55,\">\" &AX6)+1)","v":{"$error":"#NUM!"}},{"$f":"VLOOKUP(AM48,AI48:AK55,2)","v":{"$error":"#NUM!"}},{"$f":"VLOOKUP(AM48,AI48:AK55,3)","v":{"$error":"#NUM!"}},"PRO1:",{"$f":"IF(AX8=AX9, AN48, FORECAST(AX7,$AN$48:$AO$48,$AX$8:$AX$9))","v":{"$error":"#NUM!"}}]
[null,100,62,{"$f":"P21","v":80},{"$f":"P35","v":88},{"$f":"P49","v":88},{"$f":"P63","v":88},{"$f":"P77","v":87},null,null,null,100,100,100,96,88,84,80,68,50,33,null,null,null,null,null,100,100,{"$f":"AVERAGE(N49:R49)","v":89.6},{"$f":"AVERAGE(R49:T49)","v":66},{"$f":"AVERAGE(T49:V49)","v":41.5},{"$f":"AVERAGE(V49:X49)","v":{"$error":"#DIV/0!"}},null,null,{"$f":"L49","v":100},{"$f":"HLOOKUP($AX$8,$M$46:$X$55,4)","v":100},{"$f":"HLOOKUP($AX$9,$M$46:$X$55,4)","v":100},"PRI2:",{"$f":"SMALL(L48:L55,COUNTIF(L48:L55,\"<\" &AX6)+1)","v":50},{"$f":"VLOOKUP(AM49,AI48:AK55,2)","v":48},{"$f":"VLOOKUP(AM49,AI48:AK55,3)","v":48},"PRO2:",{"$f":"IF(AX8=AX9, AN49, FORECAST(AX7,$AN$49:$AO$49,$AX$8:$AX$9))","v":48}]
[null,150,89,{"$f":"P22","v":110},130,138,138,138,null,null,null,150,150,150,145,138,135,129,116,100,85,64,38,null,null,null,150,150,139.4,115,83,51,null,null,150,{"$f":"HLOOKUP($AX$8,$M$46:$X$55,5)","v":150},{"$f":"HLOOKUP($AX$9,$M$46:$X$55,5)","v":150},"PSI1:",{"$f":"LARGE(L48:L55,COUNTIF(L48:L55,\">\" &AX5)+1)","v":{"$error":"#NUM!"}},null,null,"PSO1:",{"$f":"VLOOKUP(AM50,L48:M55,2)","v":{"$error":"#NUM!"}}]
[null,200,110,139,165,182,188,187,null,null,null,200,201,195,189,182,180,173,164,151,134,113,88,63,null,null,200,201,183.8,162.66666666666666,132.66666666666666,88,null,null,200,{"$f":"HLOOKUP($AX$8,$M$46:$X$55,6)","v":201},{"$f":"HLOOKUP($AX$9,$M$46:$X$55,6)","v":201},"PSI2:",{"$f":"SMALL(L48:L55,COUNTIF(L48:L55,\"<\" &AX5)+1)","v":50},null,null,"PSO2:",{"$f":"VLOOKUP(AM51,L48:M55,2)","v":48}]
[null,250,129,157,191,214,233,239,null,null,null,250,244,230,224,214,211,204,196,187,176,162,139,112,null,null,250,244,216.6,195.66666666666666,175,137.66666666666666,null,null,250,{"$f":"HLOOKUP($AX$8,$M$46:$X$55,7)","v":244},{"$f":"HLOOKUP($AX$9,$M$46:$X$55,7)","v":244}]
[null,300,150,176,209,241,265,280,null,null,null,300,266,256,249,241,235,232,223,218,207,193,183,163,null,null,300,266,242.6,224.33333333333334,206,179.66666666666666,null,null,300,{"$f":"HLOOKUP($AX$8,$M$46:$X$55,8)","v":266},{"$f":"HLOOKUP($AX$9,$M$46:$X$55,8)","v":266}]
[null,350,173,196,227,266,294,316,null,null,null,350,288,276,266,266,258,256,250,240,229,220,210,197,null,null,350,288,264.39999999999998,248.66666666666666,229.66666666666666,209,null,null,350,{"$f":"HLOOKUP($AX$8,$M$46:$X$55,9)","v":288},{"$f":"HLOOKUP($AX$9,$M$46:$X$55,9)","v":288}]
[null,400,192,217,249,283,314,341,null,null,null,400,307,297,288,283,278,278,266,260,253,247,235,222,null,null,400,307,284.8,268,253.33333333333334,234.66666666666666,null,null,400,{"$f":"HLOOKUP($AX$8,$M$46:$X$55,10)","v":307},{"$f":"HLOOKUP($AX$9,$M$46:$X$55,10)","v":307}]
[]
[]
[]
[null,"175 GPM FLOW RATE",null,null,null,null,null,null,null,null,"Bonnet Setting","Inlet Pressure psig","OUTLET PRESSURES @ FLOW RATE, GPM",null,null,null,null,null,null,null,null,null,null,null,null,null,"Setting # 5: Inlet vs. Outlet Pressure Over Flow Range",null,null,null,null,null,null,null,"SETTING 5"]
[null,"Inlet (psig)","Outlet-1 (psig)","Outlet-2 (psig)","Outlet-3 (psig)","Outlet-4 (psig)","Outlet-5 (psig)","Outlet-6 (psig)",null,null,null,null,0,50,100,150,175,200,250,300,350,400,450,500,null,null,"Inlet (psig)","Static","50-200 [GPM]","200-300 [GPM]","300-400 [GPM]","400-500 [GPM]",null,null,"Inlet (psig)",{"$f":"CONCATENATE(\"Outlet Residual @ \" &AX$8& \" GPM\")","v":"Outlet Residual @ 0 GPM"},{"$f":"CONCATENATE(\"Outlet Residual @ \" &AX$9& \" GPM\")","v":"Outlet Residual @ 0 GPM"},null,null,"Const. PRI Interpolated @ Var. Flow"]
[null,0,{"$f":"Q5","v":0},{"$f":"Q19","v":0},{"$f":"Q33","v":0},{"$f":"Q47","v":0},{"$f":"Q61","v":0},{"$f":"Q75","v":0},null,null,5,0,null,null,null,null,null,null,null,null,null,null,null,null,null,null,{"$f":"L61","v":0}]
[null,50,{"$f":"Q6","v":27},{"$f":"Q20","v":34},{"$f":"Q34","v":32},{"$f":"Q48","v":33},{"$f":"Q62","v":33},{"$f":"Q76","v":33},null,null,null,50,50,50,44,38,33,26,12,null,null,null,null,null,null,null,{"$f":"L62","v":50},{"$f":"M62","v":50},{"$f":"AVERAGE(N62:R62)","v":38.200000000000003},{"$f":"AVERAGE(R62:T62)","v":19},{"$f":"AVERAGE(T62:V62)","v":{"$error":"#DIV/0!"}},{"$f":"AVERAGE(V62:X62)","v":{"$error":"#DIV/0!"}},null,null,{"$f":"L62","v":50},{"$f":"HLOOKUP($AX$8,$M$60:$X$69,3)","v":50},{"$f":"HLOOKUP($AX$9,$M$60:$X$69,3)","v":50},"PRI1:",{"$f":"LARGE(L62:L69,COUNTIF(L62:L69,\">\" &AX6)+1)","v":{"$error":"#NUM!"}},{"$f":"VLOOKUP(AM62,AI62:AK69,2)","v":{"$error":"#NUM!"}},{"$f":"VLOOKUP(AM62,AI62:AK69,3)","v":{"$error":"#NUM!"}},"PRO1:",{"$f":"IF(AX8=AX9, AN62, FORECAST(AX7,$AN$62:$AO$62,$AX$8:$AX$9))","v":{"$error":"#NUM!"}}]
[null,100,{"$f":"Q7","v":57},{"$f":"Q21","v":75},{"$f":"Q35","v":84},{"$f":"Q49","v":84},{"$f":"Q63","v":84},{"$f":"Q77","v":84},null,null,null,100,98,101,95,88,84,79,65,50,32,null,null,null,null,null,100,98,{"$f":"AVERAGE(N63:R63)","v":89.4},{"$f":"AVERAGE(R63:T63)","v":64.666666666666671},{"$f":"AVERAGE(T63:V63)","v":41},{"$f":"AVERAGE(V63:X63)","v":{"$error":"#DIV/0!"}},null,null,{"$f":"L63","v":100},{"$f":"HLOOKUP($AX$8,$M$60:$X$69,4)","v":98},{"$f":"HLOOKUP($AX$9,$M$60:$X$69,4)","v":98},"PRI2:",{"$f":"SMALL(L62:L69,COUNTIF(L62:L69,\"<\" &AX6)+1)","v":50},{"$f":"VLOOKUP(AM63,AI62:AK69,2)","v":50},{"$f":"VLOOKUP(AM63,AI62:AK69,3)","v":50},"PRO2:",{"$f":"IF(AX8=AX9, AN63, FORECAST(AX7,$AN$63:$AO$63,$AX$8:$AX$9))","v":50}]
[null,150,{"$f":"Q8","v":83},{"$f":"Q22","v":106},127,135,133,135,null,null,null,150,150,150,145,138,133,129,116,100,86,64,36,null,null,null,150,150,139,115,83.333333333333329,50,null,null,150,{"$f":"HLOOKUP($AX$8,$M$60:$X$69,5)","v":150},{"$f":"HLOOKUP($AX$9,$M$60:$X$69,5)","v":150},"PSI1:",{"$f":"LARGE(L62:L69,COUNTIF(L62:L69,\">\" &AX5)+1)","v":{"$error":"#NUM!"}},null,null,"PSO1:",{"$f":"VLOOKUP(AM64,L62:M69,2)","v":{"$error":"#NUM!"}}]
[null,200,105,132,157,180,184,184,null,null,null,200,200,200,196,188,184,178,167,149,133,113,90,63,null,null,200,200,189.2,164.66666666666666,131.66666666666666,88.666666666666671,null,null,200,{"$f":"HLOOKUP($AX$8,$M$60:$X$69,6)","v":200},{"$f":"HLOOKUP($AX$9,$M$60:$X$69,6)","v":200},"PSI2:",{"$f":"SMALL(L62:L69,COUNTIF(L62:L69,\"<\" &AX5)+1)","v":50},null,null,"PSO2:",{"$f":"VLOOKUP(AM65,L62:M69,2)","v":50}]
[null,250,126,155,187,211,229,233,null,null,null,250,250,247,241,233,229,224,215,202,183,163,140,114,null,null,250,250,234.8,213.66666666666666,182.66666666666666,139,null,null,250,{"$f":"HLOOKUP($AX$8,$M$60:$X$69,7)","v":250},{"$f":"HLOOKUP($AX$9,$M$60:$X$69,7)","v":250}]
[null,300,150,174,205,235,261,277,null,null,null,300,299,287,279,265,261,258,249,240,227,212,191,163,null,null,300,299,270,249,226.33333333333334,188.66666666666666,null,null,300,{"$f":"HLOOKUP($AX$8,$M$60:$X$69,8)","v":299},{"$f":"HLOOKUP($AX$9,$M$60:$X$69,8)","v":299}]
[null,350,168,194,227,258,289,312,null,null,null,350,319,310,304,294,289,286,276,270,255,249,236,216,null,null,350,319,296.60000000000002,277.33333333333331,258,233.66666666666666,null,null,350,{"$f":"HLOOKUP($AX$8,$M$60:$X$69,9)","v":319},{"$f":"HLOOKUP($AX$9,$M$60:$X$69,9)","v":319}]
[null,400,186,220,246,278,311,337,null,null,null,400,341,333,320,314,311,306,299,293,284,274,262,251,null,null,400,341,316.8,299.33333333333331,283.66666666666669,262.33333333333331,null,null,400,{"$f":"HLOOKUP($AX$8,$M$60:$X$69,10)","v":341},{"$f":"HLOOKUP($AX$9,$M$60:$X$69,10)","v":341}]
[]
[]
[]
[null,"200 GPM FLOW RATE",null,null,null,null,null,null,null,null,"Bonnet Setting","Inlet Pressure psig","OUTLET PRESSURES @ FLOW RATE, GPM",null,null,null,null,null,null,null,null,null,null,null,null,null,"Setting # 6: Inlet vs. Outlet Pressure Over Flow Range",null,null,null,null,null,null,null,"SETTING 6"]
[null,"Inlet (psig)","Outlet-1 (psig)","Outlet-2 (psig)","Outlet-3 (psig)","Outlet-4 (psig)","Outlet-5 (psig)","Outlet-6 (psig)",null,null,null,null,0,50,100,150,175,200,250,300,350,400,450,500,null,null,"Inlet (psig)","Static","50-200 [GPM]","200-300 [GPM]","300-400 [GPM]","400-500 [GPM]",null,null,"Inlet (psig)",{"$f":"CONCATENATE(\"Outlet Residual @ \" &AX$8& \" GPM\")","v":"Outlet Residual @ 0 GPM"},{"$f":"CONCATENATE(\"Outlet Residual @ \" &AX$9& \" GPM\")","v":"Outlet Residual @ 0 GPM"},null,null,"Const. PRI Interpolated @ Var. Flow"]
[null,0,{"$f":"R5","v":0},{"$f":"R19","v":0},{"$f":"R33","v":0},{"$f":"R47","v":0},{"$f":"R61","v":0},{"$f":"R75","v":0},null,null,6,0,null,null,null,null,null,null,null,null,null,null,null,null,null,null,{"$f":"L75","v":0}]
[null,50,22,{"$f":"R20","v":27},{"$f":"R34","v":27},{"$f":"R48","v":28},{"$f":"R62","v":26},{"$f":"R76","v":24},null,null,null,50,50,50,42,40,33,24,18,null,null,null,null,null,null,null,{"$f":"L76","v":50},{"$f":"M76","v":50},{"$f":"AVERAGE(N76:R76)","v":37.799999999999997},{"$f":"AVERAGE(R76:T76)","v":21},{"$f":"AVERAGE(T76:V76)","v":{"$error":"#DIV/0!"}},{"$f":"AVERAGE(V76:X76)","v":{"$error":"#DIV/0!"}},null,null,{"$f":"L76","v":50},{"$f":"HLOOKUP($AX$8,$M$74:$X$83,3)","v":50},{"$f":"HLOOKUP($AX$9,$M$74:$X$83,3)","v":50},"PRI1:",{"$f":"LARGE(L76:L83,COUNTIF(L76:L83,\">\" &AX6)+1)","v":{"$error":"#NUM!"}},{"$f":"VLOOKUP(AM76,AI76:AK83,2)","v":{"$error":"#NUM!"}},{"$f":"VLOOKUP(AM76,AI76:AK83,3)","v":{"$error":"#NUM!"}},"PRO1:",{"$f":"IF(AX8=AX9, AN76, FORECAST(AX7,$AN$76:$AO$76,$AX$8:$AX$9))","v":{"$error":"#NUM!"}}]
[null,100,55,{"$f":"R21","v":72},{"$f":"R35","v":79},{"$f":"R49","v":80},{"$f":"R63","v":79},{"$f":"R77","v":79},null,null,null,100,100,100,93,87,84,79,67,50,35,null,null,null,null,null,100,100,{"$f":"AVERAGE(N77:R77)","v":88.6},{"$f":"AVERAGE(R77:T77)","v":65.333333333333329},{"$f":"AVERAGE(T77:V77)","v":42.5},{"$f":"AVERAGE(V77:X77)","v":{"$error":"#DIV/0!"}},null,null,{"$f":"L77","v":100},{"$f":"HLOOKUP($AX$8,$M$74:$X$83,4)","v":100},{"$f":"HLOOKUP($AX$9,$M$74:$X$83,4)","v":100},"PRI2:",{"$f":"SMALL(L76:L83,COUNTIF(L76:L83,\"<\" &AX6)+1)","v":50},{"$f":"VLOOKUP(AM77,AI76:AK83,2)","v":50},{"$f":"VLOOKUP(AM77,AI76:AK83,3)","v":50},"PRO2:",{"$f":"IF(AX8=AX9, AN77, FORECAST(AX7,$AN$77:$AO$77,$AX$8:$AX$9))","v":50}]
[null,150,81,{"$f":"R22","v":102},123,129,129,129,null,null,null,150,150,150,144,138,135,129,117,102,84,66,39,null,null,null,150,150,139.19999999999999,116,84,52.5,null,null,150,{"$f":"HLOOKUP($AX$8,$M$74:$X$83,5)","v":150},{"$f":"HLOOKUP($AX$9,$M$74:$X$83,5)","v":150},"PSI1:",{"$f":"LARGE(L76:L83,COUNTIF(L76:L83,\">\" &AX5)+1)","v":{"$error":"#NUM!"}},null,null,"PSO1:",{"$f":"VLOOKUP(AM78,L76:M83,2)","v":{"$error":"#NUM!"}}]
[null,200,104,128,156,173,178,179,null,null,null,200,200,200,196,187,184,179,166,154,134,113,90,65,null,null,200,200,189.2,166.33333333333334,133.66666666666666,89.333333333333329,null,null,200,{"$f":"HLOOKUP($AX$8,$M$74:$X$83,6)","v":200},{"$f":"HLOOKUP($AX$9,$M$74:$X$83,6)","v":200},"PSI2:",{"$f":"SMALL(L76:L83,COUNTIF(L76:L83,\"<\" &AX5)+1)","v":50},null,null,"PSO2:",{"$f":"VLOOKUP(AM79,L76:M83,2)","v":50}]
[null,250,123,151,183,204,224,228,null,null,null,250,250,250,245,239,233,228,217,199,183,164,144,115,null,null,250,250,239,214.66666666666666,182,141,null,null,250,{"$f":"HLOOKUP($AX$8,$M$74:$X$83,7)","v":250},{"$f":"HLOOKUP($AX$9,$M$74:$X$83,7)","v":250}]
[null,300,142,172,203,232,258,271,null,null,null,300,300,300,289,280,277,271,264,249,233,213,192,163,null,null,300,300,283.39999999999998,261.33333333333331,231.66666666666666,189.33333333333334,null,null,300,{"$f":"HLOOKUP($AX$8,$M$74:$X$83,8)","v":300},{"$f":"HLOOKUP($AX$9,$M$74:$X$83,8)","v":300}]
[null,350,167,191,224,256,286,305,null,null,null,350,350,335,326,316,312,305,295,286,277,263,240,217,null,null,350,350,318.8,295.33333333333331,275.33333333333331,240,null,null,350,{"$f":"HLOOKUP($AX$8,$M$74:$X$83,9)","v":350},{"$f":"HLOOKUP($AX$9,$M$74:$X$83,9)","v":350}]
[null,400,183,212,242,278,306,332,null,null,null,400,372,362,348,341,337,332,322,318,304,294,281,261,null,null,400,372,344,324,305.33333333333331,278.66666666666669,null,null,400,{"$f":"HLOOKUP($AX$8,$M$74:$X$83,10)","v":372},{"$f":"HLOOKUP($AX$9,$M$74:$X$83,10)","v":372}]
[]
[]
[]
[null,"250 GPM FLOW RATE"]
[null,"Inlet (psig)","Outlet-1 (psig)","Outlet-2 (psig)","Outlet-3 (psig)","Outlet-4 (psig)","Outlet-5 (psig)","Outlet-6 (psig)"]
[null,0,{"$f":"S5","v":0},{"$f":"S19","v":0},{"$f":"S33","v":0},{"$f":"S47","v":0},{"$f":"S61","v":0},{"$f":"S75","v":0}]
[null,50,{"$f":"S6","v":16},{"$f":"S20","v":15},{"$f":"S34","v":14},{"$f":"S48","v":15},{"$f":"S62","v":12},{"$f":"S76","v":18}]
[null,100,{"$f":"S7","v":45},{"$f":"S21","v":62},{"$f":"S35","v":67},{"$f":"S49","v":68},{"$f":"S63","v":65},{"$f":"S77","v":67}]
[null,150,{"$f":"S8","v":72},{"$f":"S22","v":94},115,116,116,117]
[null,200,98,120,147,164,167,166]
[null,250,118,144,176,196,215,217]
[null,300,136,166,194,223,249,264]
[null,350,155,186,217,250,276,295]
[null,400,177,205,237,266,299,322]
[]
[]
[]
[null,"300 GPM FLOW RATE"]
[null,"Inlet (psig)","Outlet-1 (psig)","Outlet-2 (psig)","Outlet-3 (psig)","Outlet-4 (psig)","Outlet-5 (psig)","Outlet-6 (psig)"]
[null,0,{"$f":"T5","v":0},{"$f":"T19","v":0},{"$f":"T33","v":0},{"$f":"T47","v":0},{"$f":"T61","v":0},{"$f":"T75","v":0}]
[null,50,0,0,{"$f":"T34","v":0},{"$f":"T48","v":0},{"$f":"T62","v":0},{"$f":"T76","v":0}]
[null,100,36,49,{"$f":"T35","v":51},{"$f":"T49","v":50},{"$f":"T63","v":50},{"$f":"T77","v":50}]
[null,150,62,85,{"$f":"T36","v":102},{"$f":"T50","v":100},{"$f":"T64","v":100},{"$f":"T78","v":102}]
[null,200,86,112,137,151,149,154]
[null,250,109,138,165,187,202,199]
[null,300,131,160,186,218,240,249]
[null,350,150,180,210,240,270,286]
[null,400,170,199,230,260,293,318]
[]
[]
[]
[null,"350 GPM FLOW RATE"]
[null,"Inlet (psig)","Outlet-1 (psig)","Outlet-2 (psig)","Outlet-3 (psig)","Outlet-4 (psig)","Outlet-5 (psig)","Outlet-6 (psig)"]
[null,0,{"$f":"U5","v":0},{"$f":"U19","v":0},{"$f":"U33","v":0},{"$f":"U47","v":0},{"$f":"U61","v":0},{"$f":"U75","v":0}]
[null,50,0,0,{"$f":"U34","v":0},{"$f":"U48","v":0},{"$f":"U62","v":0},{"$f":"U76","v":0}]
[null,100,25,30,{"$f":"U35","v":31},{"$f":"U49","v":33},{"$f":"U63","v":32},{"$f":"U77","v":35}]
[null,150,53,76,{"$f":"U36","v":86},{"$f":"U50","v":85},{"$f":"U64","v":86},{"$f":"U78","v":84}]
[null,200,78,104,127,134,133,134]
[null,250,100,129,156,176,183,183]
[null,300,122,151,180,207,227,233]
[null,350,144,171,201,229,255,277]
[null,400,162,192,224,253,284,304]
[]
[]
[]
[null,"400 GPM FLOW RATE"]
[null,"Inlet (psig)","Outlet-1 (psig)","Outlet-2 (psig)","Outlet-3 (psig)","Outlet-4 (psig)","Outlet-5 (psig)","Outlet-6 (psig)"]
[null,0,{"$f":"V5","v":0},{"$f":"V19","v":0},{"$f":"V33","v":0},{"$f":"V47","v":0},{"$f":"V61","v":0},{"$f":"V75","v":0}]
[null,50,0,0,0,0,0,0]
[null,100,0,0,0,0,0,0]
[null,150,42,62,63,64,64,66]
[null,200,68,92,113,113,113,113]
[null,250,92,118,145,162,163,164]
[null,300,113,139,171,193,212,213]
[null,350,135,161,195,220,249,263]
[null,400,157,185,214,247,274,294]
[]
[]
[]
[null,"450 GPM FLOW RATE"]
[null,"Inlet (psig)","Outlet-1 (psig)","Outlet-2 (psig)","Outlet-3 (psig)","Outlet-4 (psig)","Outlet-5 (psig)","Outlet-6 (psig)"]
[null,0,{"$f":"W5","v":0},{"$f":"W19","v":0},{"$f":"W33","v":0},{"$f":"W47","v":0},{"$f":"W61","v":0},{"$f":"W75","v":0}]
[null,50,0,0,0,0,0,0]
[null,100,0,0,0,0,0,0]
[null,150,28,38,38,38,36,39]
[null,200,57,82,88,88,90,90]
[null,250,83,107,134,139,140,144]
[null,300,105,131,161,183,191,192]
[null,350,124,153,187,210,236,240]
[null,400,142,176,204,235,262,281]
[]
[]
[]
[null,"500 GPM FLOW RATE"]
[null,"Inlet (psig)","Outlet-1 (psig)","Outlet-2 (psig)","Outlet-3 (psig)","Outlet-4 (psig)","Outlet-5 (psig)","Outlet-6 (psig)"]
[null,0,{"$f":"X5","v":0},{"$f":"X19","v":0},{"$f":"X33","v":0},{"$f":"X47","v":0},{"$f":"X61","v":0},{"$f":"X75","v":0}]
[null,50,0,0,0,0,0,0]
[null,100,0,0,0,0,0,0]
[null,150,0,0,0,0,0,0]
[null,200,41,65,65,63,63,65]
[null,250,69,97,114,112,114,115]
[null,300,94,120,147,163,163,163]
[null,350,114,141,173,197,216,217]
[null,400,136,162,192,222,251,261]

{"sheet":"Charts- Each GPM","index":9,"n_rows":120,"n_cols":66,"rows_kept":120,"cut":false,"hidden":true,"merged":[[0,65,1,97],[0,0,1,31],[60,0,61,31],[119,0,120,31],[0,32,1,64],[60,32,61,64],[119,32,120,64]]}
["IE2600A-2.5\" ANGLE- DOUBLE SPRING CONFIGURATION",null,null,null,null,null,null,null,null,null,null,null,null,null,null,null,null,null,null,null,null,null,null,null,null,null,null,null,null,null,null,null,"IE2600A-2.5\" INLINE- DOUBLE SPRING CONFIGURATION",null,null,null,null,null,null,null,null,null,null,null,null,null,null,null,null,null,null,null,null,null,null,null,null,null,null,null,null,null,null,null,null,"IE2600A-1.5\" ANGLE"]
[]
[]
[]
[]
[]
[]
[]
[]
[]
[]
[]
[]
[]
[]
[]
[]
[]
[]
[]
[]
[]
[]
[]
[]
[]
[]
[]
[]
[]
[]
[]
[]
[]
[]
[]
[]
[]
[]
[]
[]
[]
[]
[]
[]
[]
[]
[]
[]
[]
[]
[]
[]
[]
[]
[]
[]
[]
[]
[]
["IE2600A-2.5\" ANGLE- SINGLE BIG SPRING CONFIGURATION",null,null,null,null,null,null,null,null,null,null,null,null,null,null,null,null,null,null,null,null,null,null,null,null,null,null,null,null,null,null,null,"IE2600A-2.5\" INLINE- BIG SPRING CONFIGURATION"]
[]
[]
[]
[]
[]
[]
[]
[]
[]
[]
[]
[]
[]
[]
[]
[]
[]
[]
[]
[]
[]
[]
[]
[]
[]
[]
[]
[]
[]
[]
[]
[]
[]
[]
[]
[]
[]
[]
[]
[]
[]
[]
[]
[]
[]
[]
[]
[]
[]
[]
[]
[]
[]
[]
[]
[]
[]
[]
["IE2600A-2.5\" ANGLE- SINGLE SMALL SPRING CONFIGURATION",null,null,null,null,null,null,null,null,null,null,null,null,null,null,null,null,null,null,null,null,null,null,null,null,null,null,null,null,null,null,null,"IE2600A-2.5\" INLINE- SMALL SPRING CONFIGURATION"]

{"sheet":"IE2600A-250-Straight_DATA","index":10,"n_rows":97,"n_cols":39,"rows_kept":97,"cut":false,"hidden":true,"merged":[[86,3,87,3],[86,4,87,4],[86,5,86,16],[88,3,96,3],[86,23,86,31],[87,23,88,23],[87,24,88,24],[87,25,88,25],[87,28,88,29],[86,19,86,20],[72,3,73,3],[72,4,73,4],[72,5,72,16],[72,23,72,31],[73,23,74,23],[73,24,74,24],[73,25,74,25],[73,28,74,29],[74,3,82,3],[72,19,72,20],[58,3,59,3],[58,4,59,4],[58,5,58,16],[58,23,58,31],[59,23,60,23],[59,24,60,24],[59,25,60,25],[59,28,60,29],[60,3,68,3],[58,19,58,20],[44,3,45,3],[44,4,45,4],[44,5,44,16],[44,23,44,31],[45,23,46,23],[45,24,46,24],[45,25,46,25],[45,28,46,29],[46,3,54,3],[44,19,44,20],[30,3,31,3],[30,4,31,4],[30,5,30,16],[30,23,30,31],[31,23,32,23],[31,24,32,24],[31,25,32,25],[31,28,32,29],[32,3,40,3],[30,19,30,20],[17,34,17,35],[18,3,26,3],[18,34,18,35],[19,34,19,35],[20,34,20,35],[21,34,21,35],[22,34,22,35],[23,34,23,35],[16,3,17,3],[16,4,17,4],[16,5,16,16],[16,23,16,31],[17,23,18,23],[17,24,18,24],[17,25,18,25],[24,34,24,35],[3,34,3,38],[4,3,12,3],[4,34,4,36],[5,34,5,36],[6,34,6,36],[7,34,7,36],[8,34,8,36],[0,0,0,16],[2,3,3,3],[2,4,3,4],[2,5,2,16],[17,28,18,29],[2,23,2,31],[3,23,4,23],[3,24,4,24],[3,25,4,25],[3,28,4,29],[16,19,16,20],[2,19,2,20],[0,17,0,20]]}
["Data from Project# 4789893180, Date: 2021-05-26",null,null,null,null,null,null,null,null,null,null,null,null,null,null,null,null,"Double click this icon to open UL results "]
[null,null,null,null,"Residual ","Static"]
[null,null,null,"Bonnet Setting","Inlet Pressure psig","OUTLET PRESSURES @ FLOW RATE, GPM",null,null,null,null,null,null,null,null,null,null,null,null,null,"Setting # 1: Inlet Pressure",null,null,null,"SETTING 1"]
[null,null,null,null,null,0,50,100,150,175,200,250,300,350,400,450,500,null,null,"Inlet (psig)","Static",null,null,"Inlet (psig)",{"$f":"CONCATENATE(\"Outlet Residual @ \" &AM$8& \" GPM\")","v":"Outlet Residual @ 0 GPM"},{"$f":"CONCATENATE(\"Outlet Residual @ \" &AM$9& \" GPM\")","v":"Outlet Residual @ 0 GPM"},null,null,"Const. PRI Interpolated @ Var. Flow",null,null,null,null,null,"VARIABLES"]
[null,null,null,1,0,0,0,0,0,0,0,0,0,0,0,0,0,null,null,{"$f":"E5","v":0},{"$f":"F5","v":0},null,null,null,null,null,null,null,null,null,null,null,null,null,"Static Inlet Pressure",null,null,"PSI:",{"$f":"Database!$E$2","v":0}]
[null,null,null,null,50,25,16,14,15,17,16,12,null,null,null,null,null,null,null,{"$f":"E6","v":50},{"$f":"F6","v":25},null,null,{"$f":"E6","v":50},{"$f":"HLOOKUP($AM$8,$F$4:$Q$13,3)","v":25},{"$f":"HLOOKUP($AM$9,$F$4:$Q$13,3)","v":25},"PRI1:",{"$f":"LARGE(E6:E13,COUNTIF(E6:E13,\">\" &AM6)+1)","v":{"$error":"#NUM!"}},{"$f":"VLOOKUP(AB6,X6:Z13,2)","v":{"$error":"#NUM!"}},{"$f":"VLOOKUP(AB6,X6:Z13,3)","v":{"$error":"#NUM!"}},"PRO1:",{"$f":"IF(AM8=AM9, AC6, FORECAST(AM7,$AC$6:$AD$6,$AM$8:$AM$9))","v":{"$error":"#NUM!"}},null,null,"Residual Inlet Pressure",null,null,"PRI:",{"$f":"Database!$E$3","v":0}]
[null,null,null,null,100,43,38,33,31,31,32,30,29,27,22,null,null,null,null,100,43,null,null,{"$f":"E7","v":100},{"$f":"HLOOKUP($AM$8,$F$4:$Q$13,4)","v":43},{"$f":"HLOOKUP($AM$9,$F$4:$Q$13,4)","v":43},"PRI2:",{"$f":"SMALL(E6:E13,COUNTIF(E6:E13,\"<\" &AM6)+1)","v":50},{"$f":"VLOOKUP(AB7,X6:Z13,2)","v":25},{"$f":"VLOOKUP(AB7,X6:Z13,3)","v":25},"PRO2:",{"$f":"IF(AM8=AM9, AC7, FORECAST(AM7,$AC$7:$AD$7,$AM$8:$AM$9))","v":25},null,null,"Flow Rate",null,null,"Q0:",{"$f":"IF(Database!$E$4=500,499.99,Database!$E$4)","v":0}]
[null,null,null,null,150,65,58,53,49,48,51,49,48,45,41,37,null,null,null,150,65,null,null,150,{"$f":"HLOOKUP($AM$8,$F$4:$Q$13,5)","v":65},{"$f":"HLOOKUP($AM$9,$F$4:$Q$13,5)","v":65},"PSI1:",{"$f":"LARGE(E6:E13,COUNTIF(E6:E13,\">\" &AM5)+1)","v":{"$error":"#NUM!"}},null,null,"PSO1:",{"$f":"VLOOKUP(AB8,E6:F13,2)","v":{"$error":"#NUM!"}},null,null,"Nearest known Flow Rate, 1",null,null,"Q1:",{"$f":"LARGE(F4:Q4,COUNTIF(F4:Q4,\">\" &AM7)+1)","v":0}]
[null,null,null,null,200,96,78,75,74,73,69,66,64,63,61,56,52,null,null,200,96,null,null,200,{"$f":"HLOOKUP($AM$8,$F$4:$Q$13,6)","v":96},{"$f":"HLOOKUP($AM$9,$F$4:$Q$13,6)","v":96},"PSI2:",{"$f":"SMALL(E6:E13,COUNTIF(E6:E13,\"<\" &AM5)+1)","v":50},null,null,"PSO2:",{"$f":"VLOOKUP(AB9,E6:F13,2)","v":25},null,null,"Nearest known Flow Rate, 2",null,null,"Q2:",{"$f":"SMALL(F4:Q4,COUNTIF(F4:Q4,\"<\" &AM7)+1)","v":0}]
[null,null,null,null,250,116,108,106,104,100,101,93,89,88,84,79,72,null,null,250,116,null,null,250,{"$f":"HLOOKUP($AM$8,$F$4:$Q$13,7)","v":116},{"$f":"HLOOKUP($AM$9,$F$4:$Q$13,7)","v":116}]
[null,null,null,null,300,136,128,125,123,122,119,111,107,106,104,99,92,null,null,300,136,null,null,300,{"$f":"HLOOKUP($AM$8,$F$4:$Q$13,8)","v":136},{"$f":"HLOOKUP($AM$9,$F$4:$Q$13,8)","v":136}]
[null,null,null,null,350,156,145,143,141,139,138,137,126,124,125,120,115,null,null,{"$f":"E12","v":350},156,null,null,350,{"$f":"HLOOKUP($AM$8,$F$4:$Q$13,9)","v":156},{"$f":"HLOOKUP($AM$9,$F$4:$Q$13,9)","v":156}]
[null,null,null,null,400,169,154,150,145,146,144,143,135,132,135,133,127,null,null,400,169,null,null,400,{"$f":"HLOOKUP($AM$8,$F$4:$Q$13,10)","v":169},{"$f":"HLOOKUP($AM$9,$F$4:$Q$13,10)","v":169}]
[]
[]
[null,null,null,null,"Residual ","Static"]
[null,null,null,"Bonnet Setting","Inlet Pressure psig","OUTLET PRESSURES @ FLOW RATE, GPM",null,null,null,null,null,null,null,null,null,null,null,null,null,"Setting # 2: Inlet Pressure",null,null,null,"SETTING 2"]
[null,null,null,null,null,0,50,100,150,175,200,250,300,350,400,450,500,null,null,"Inlet (psig)","Static",null,null,"Inlet (psig)",{"$f":"CONCATENATE(\"Outlet Residual @ \" &AM$8& \" GPM\")","v":"Outlet Residual @ 0 GPM"},{"$f":"CONCATENATE(\"Outlet Residual @ \" &AM$9& \" GPM\")","v":"Outlet Residual @ 0 GPM"},null,null,"Const. PRI Interpolated @ Var. Flow",null,null,null,null,null,"2.5\" Straight Single Spring",null,"Calculated Static Outlet Pressure","Calculated Residual Outlet Pressure","Max Flow Rate"]
[null,null,null,2,0,0,0,0,0,0,0,0,0,0,0,0,0,null,null,{"$f":"E19","v":0},{"$f":"F19","v":0},null,null,null,null,null,null,null,null,null,null,null,null,null,"Setting 1",null,{"$f":"IF($AF$8=$AF$9,$AF$8,FORECAST($AM$5,$AF$8:$AF$9,$AB$8:$AB$9))","v":{"$error":"#NUM!"}},{"$f":"IF($AF$6=$AF$7,$AF$6,FORECAST($AM$6,$AF$6:$AF$7,$AB$6:$AB$7))","v":{"$error":"#NUM!"}},500]
[null,null,null,null,50,41,34,36,23,22,19,13,null,null,null,null,null,null,null,{"$f":"E20","v":50},{"$f":"F20","v":41},null,null,{"$f":"E20","v":50},{"$f":"HLOOKUP($AM$8,$F$18:$Q$27,3)","v":41},{"$f":"HLOOKUP($AM$9,$F$18:$Q$27,3)","v":41},"PRI1:",{"$f":"LARGE(X20:X28,COUNTIF(X20:X28,\">\" &AM6)+1)","v":{"$error":"#NUM!"}},{"$f":"VLOOKUP(AB20,X20:Z27,2)","v":{"$error":"#NUM!"}},{"$f":"VLOOKUP(AB20,X20:Z27,3)","v":{"$error":"#NUM!"}},"PRO1:",{"$f":"IF(AM8=AM9, AC20, FORECAST(AM7,$AC$20:$AD$20,$AM$8:$AM$9))","v":{"$error":"#NUM!"}},null,null,"Setting 2",null,{"$f":"IF($AF$22=$AF$23,$AF$22,FORECAST($AM$5,$AF$22:$AF$23,$AB$22:$AB$23))","v":{"$error":"#NUM!"}},{"$f":"IF($AF$20=$AF$21,$AF$20,FORECAST($AM$6,$AF$20:$AF$21,$AB$20:$AB$21))","v":{"$error":"#NUM!"}},500]
[null,null,null,null,100,61,55,50,48,46,42,38,33,29,21,null,null,null,null,100,61,null,null,{"$f":"E21","v":100},{"$f":"HLOOKUP($AM$8,$F$18:$Q$27,4)","v":61},{"$f":"HLOOKUP($AM$9,$F$18:$Q$27,4)","v":61},"PRI2:",{"$f":"SMALL(X20:X28,COUNTIF(X20:X28,\"<\" &AM6)+1)","v":50},{"$f":"VLOOKUP(AB21,X20:Z27,2)","v":41},{"$f":"VLOOKUP(AB21,X20:Z27,3)","v":41},"PRO2:",{"$f":"IF(AM8=AM9, AC21, FORECAST(AM7,$AC$21:$AD$21,$AM$8:$AM$9))","v":41},null,null,"Setting 3",null,{"$f":"IF($AF$36=$AF$37,$AF$36,FORECAST($AM$5,$AF$36:$AF$37,$AB$36:$AB$37))","v":{"$error":"#NUM!"}},{"$f":"IF($AF$34=$AF$35,$AF$34,FORECAST($AM$6,$AF$34:$AF$35,$AB$34:$AB$35))","v":{"$error":"#NUM!"}},500]
[null,null,null,null,150,82,75,70,67,65,64,61,56,51,44,39,34,null,null,150,82,null,null,150,{"$f":"HLOOKUP($AM$8,$F$18:$Q$27,5)","v":82},{"$f":"HLOOKUP($AM$9,$F$18:$Q$27,5)","v":82},"PSI1:",{"$f":"LARGE(X20:X28,COUNTIF(X20:X28,\">\" &AM5)+1)","v":{"$error":"#NUM!"}},null,null,"PSO1:",{"$f":"VLOOKUP(AB22,T20:U28,2)","v":{"$error":"#NUM!"}},null,null,"Setting 4",null,{"$f":"IF($AF$50=$AF$51,$AF$50,FORECAST($AM$5,$AF$50:$AF$51,$AB$50:$AB$51))","v":{"$error":"#NUM!"}},{"$f":"IF($AF$48=$AF$49,$AF$48,FORECAST($AM$6,$AF$48:$AF$49,$AB$48:$AB$49))","v":{"$error":"#NUM!"}},500]
[null,null,null,null,200,98,92,86,86,82,78,74,73,71,66,60,53,null,null,200,98,null,null,200,{"$f":"HLOOKUP($AM$8,$F$18:$Q$27,6)","v":98},{"$f":"HLOOKUP($AM$9,$F$18:$Q$27,6)","v":98},"PSI2:",{"$f":"SMALL(X20:X28,COUNTIF(X20:X28,\"<\" &AM5)+1)","v":50},null,null,"PSO2:",{"$f":"VLOOKUP(AB23,T20:U28,2)","v":41},null,null,"Setting 5",null,{"$f":"IF($AF$64=$AF$65,$AF$64,FORECAST($AM$5,$AF$64:$AF$65,$AB$64:$AB$65))","v":{"$error":"#NUM!"}},{"$f":"IF($AF$62=$AF$63,$AF$62,FORECAST($AM$6,$AF$62:$AF$63,$AB$62:$AB$63))","v":{"$error":"#NUM!"}},500]
[null,null,null,null,250,117,110,106,104,103,103,93,90,89,86,80,74,null,null,250,117,null,null,250,{"$f":"HLOOKUP($AM$8,$F$18:$Q$27,7)","v":117},{"$f":"HLOOKUP($AM$9,$F$18:$Q$27,7)","v":117},null,null,null,null,null,null,null,null,"Setting 6",null,{"$f":"IF($AF$78=$AF$79,$AF$78,FORECAST($AM$5,$AF$78:$AF$79,$AB$78:$AB$79))","v":{"$error":"#NUM!"}},{"$f":"IF($AF$76=$AF$77,$AF$76,FORECAST($AM$6,$AF$76:$AF$77,$AB$76:$AB$77))","v":{"$error":"#NUM!"}},500]
[null,null,null,null,300,138,130,124,122,121,120,114,110,109,106,101,96,null,null,300,138,null,null,300,{"$f":"HLOOKUP($AM$8,$F$18:$Q$27,8)","v":138},{"$f":"HLOOKUP($AM$9,$F$18:$Q$27,8)","v":138},null,null,null,null,null,null,null,null,"Setting 7",null,{"$f":"IF($AF$92=$AF$93,$AF$92,FORECAST($AM$5,$AF$92:$AF$93,$AB$92:$AB$93))","v":{"$error":"#NUM!"}},{"$f":"IF($AF$90=$AF$91,$AF$90,FORECAST($AM$6,$AF$90:$AF$91,$AB$90:$AB$91))","v":{"$error":"#NUM!"}},500]
[null,null,null,null,350,159,147,143,140,140,140,137,126,128,126,121,115,null,null,{"$f":"E26","v":350},{"$f":"F26","v":159},null,null,350,{"$f":"HLOOKUP($AM$8,$F$18:$Q$27,9)","v":159},{"$f":"HLOOKUP($AM$9,$F$18:$Q$27,9)","v":159}]
[null,null,null,null,390,174,164,160,157,155,153,152,143,141,140,137,131,null,null,{"$f":"E27","v":390},{"$f":"F27","v":174},null,null,390,{"$f":"HLOOKUP($AM$8,$F$18:$Q$27,10)","v":174},{"$f":"HLOOKUP($AM$9,$F$18:$Q$27,10)","v":174}]
[null,null,null,null,null,null,null,null,null,null,null,null,null,null,null,null,null,null,null,400,{"$f":"U26+(((U27-U26)/(T27-T26))*(T28-T26))","v":177.75},null,null,400,{"$f":"Y26+(((Y27-Y26)/(X27-X26))*(X28-X26))","v":177.75},{"$f":"Z26+(((Z27-Z26)/(X27-X26))*(X28-X26))","v":177.75}]
[]
[null,null,null,null,"Residual ","Static"]
[null,null,null,"Bonnet Setting","Inlet Pressure psig","OUTLET PRESSURES @ FLOW RATE, GPM",null,null,null,null,null,null,null,null,null,null,null,null,null,"Setting # 3: Inlet Pressure",null,null,null,"SETTING 3",null,null,null,null,null,null,null,null,null,null,"1.5\" Angle"]
[null,null,null,null,null,0,50,100,150,175,200,250,300,350,400,450,500,null,null,"Inlet (psig)","Static",null,null,"Inlet (psig)",{"$f":"CONCATENATE(\"Outlet Residual @ \" &AM$8& \" GPM\")","v":"Outlet Residual @ 0 GPM"},{"$f":"CONCATENATE(\"Outlet Residual @ \" &AM$9& \" GPM\")","v":"Outlet Residual @ 0 GPM"},null,null,"Const. PRI Interpolated @ Var. Flow",null,null,null,null,null,"2.5\" Angle"]
[null,null,null,3,0,0,0,0,0,0,0,0,0,0,0,0,0,null,null,{"$f":"E33","v":0},{"$f":"F33","v":0},null,null,null,null,null,null,null,null,null,null,null,null,null,"2.5\" Inline"]
[null,null,null,null,50,49,45,36,32,28,26,20,10,null,null,null,null,null,null,{"$f":"E34","v":50},49,null,null,{"$f":"E34","v":50},{"$f":"HLOOKUP($AM$8,$F$32:$Q$41,3)","v":49},{"$f":"HLOOKUP($AM$9,$F$32:$Q$41,3)","v":49},"PRI1:",{"$f":"LARGE(X34:X41,COUNTIF(X34:X41,\">\" &AM6)+1)","v":{"$error":"#NUM!"}},{"$f":"VLOOKUP(AB34,X34:Z41,2)","v":{"$error":"#NUM!"}},{"$f":"VLOOKUP(AB34,X34:Z41,3)","v":{"$error":"#NUM!"}},"PRO1:",{"$f":"IF(AM8=AM9, AC34, FORECAST(AM7,$AC$34:$AD$34,$AM$8:$AM$9))","v":{"$error":"#NUM!"}}]
[null,null,null,null,100,73,68,61,57,55,55,48,42,35,27,null,null,null,null,100,73,null,null,100,{"$f":"HLOOKUP($AM$8,$F$32:$Q$41,4)","v":73},{"$f":"HLOOKUP($AM$9,$F$32:$Q$41,4)","v":73},"PRI2:",{"$f":"SMALL(X34:X41,COUNTIF(X34:X41,\"<\" &AM6)+1)","v":50},{"$f":"VLOOKUP(AB35,X34:Z41,2)","v":49},{"$f":"VLOOKUP(AB35,X34:Z41,3)","v":49},"PRO2:",{"$f":"IF(AM8=AM9, AC35, FORECAST(AM7,$AC$35:$AD$35,$AM$8:$AM$9))","v":49}]
[null,null,null,null,150,93,88,83,78,78,75,73,67,62,56,48,37,null,null,150,93,null,null,150,{"$f":"HLOOKUP($AM$8,$F$32:$Q$41,5)","v":93},{"$f":"HLOOKUP($AM$9,$F$32:$Q$41,5)","v":93},"PSI1:",{"$f":"LARGE(X34:X41,COUNTIF(X34:X41,\">\" &AM5)+1)","v":{"$error":"#NUM!"}},null,null,"PSO1:",{"$f":"VLOOKUP(AB36,T34:U41,2)","v":{"$error":"#NUM!"}}]
[null,null,null,null,200,113,108,101,99,98,98,93,89,84,81,73,65,null,null,200,113,null,null,200,{"$f":"HLOOKUP($AM$8,$F$32:$Q$41,6)","v":113},{"$f":"HLOOKUP($AM$9,$F$32:$Q$41,6)","v":113},"PSI2:",{"$f":"SMALL(X34:X41,COUNTIF(X34:X41,\"<\" &AM5)+1)","v":50},null,null,"PSO2:",{"$f":"VLOOKUP(AB37,T34:U41,2)","v":49}]
[null,null,null,null,250,133,125,120,118,117,117,114,109,106,100,96,88,null,null,{"$f":"E38","v":250},133,null,null,250,{"$f":"HLOOKUP($AM$8,$F$32:$Q$41,7)","v":133},{"$f":"HLOOKUP($AM$9,$F$32:$Q$41,7)","v":133}]
[null,null,null,null,300,151,143,139,137,138,138,133,128,124,121,116,109,null,null,{"$f":"E39","v":300},{"$f":"F39","v":151},null,null,300,{"$f":"HLOOKUP($AM$8,$F$32:$Q$41,8)","v":151},{"$f":"HLOOKUP($AM$9,$F$32:$Q$41,8)","v":151}]
[null,null,null,null,355,174,164,159,157,158,158,154,150,146,143,137,131,null,null,{"$f":"E40","v":355},174,null,null,355,{"$f":"HLOOKUP($AM$8,$F$32:$Q$41,9)","v":174},{"$f":"HLOOKUP($AM$9,$F$32:$Q$41,9)","v":174}]
[null,null,null,null,null,null,null,null,null,null,null,null,null,null,null,null,null,null,null,400,{"$f":"U39+(((U40-U39)/(T40-T39))*(T41-T39))","v":192.81818181818181},null,null,400,{"$f":"Y39+(((Y40-Y39)/(X40-X39))*(X41-X39))","v":192.81818181818181},{"$f":"Z39+(((Z40-Z39)/(X40-X39))*(X41-X39))","v":192.81818181818181}]
[]
[]
[null,null,null,null,"Residual ","Static"]
[null,null,null,"Bonnet Setting","Inlet Pressure psig","OUTLET PRESSURES @ FLOW RATE, GPM",null,null,null,null,null,null,null,null,null,null,null,null,null,"Setting # 4: Inlet Pressure",null,null,null,"SETTING 4"]
[null,null,null,null,null,0,50,100,150,175,200,250,300,350,400,450,500,null,null,"Inlet (psig)","Static",null,null,"Inlet (psig)",{"$f":"CONCATENATE(\"Outlet Residual @ \" &AM$8& \" GPM\")","v":"Outlet Residual @ 0 GPM"},{"$f":"CONCATENATE(\"Outlet Residual @ \" &AM$9& \" GPM\")","v":"Outlet Residual @ 0 GPM"},null,null,"Const. PRI Interpolated @ Var. Flow"]
[null,null,null,4,0,0,0,0,0,0,0,0,0,0,0,0,0,null,null,{"$f":"E47","v":0},{"$f":"F47","v":0}]
[null,null,null,null,50,50,48,43,40,36,32,22,10,null,null,null,null,null,null,{"$f":"E48","v":50},50,null,null,{"$f":"E48","v":50},{"$f":"HLOOKUP($AM$8,$F$46:$Q$55,3)","v":50},{"$f":"HLOOKUP($AM$9,$F$46:$Q$55,3)","v":50},"PRI1:",{"$f":"LARGE(X48:X55,COUNTIF(X48:X55,\">\" &AM6)+1)","v":{"$error":"#NUM!"}},{"$f":"VLOOKUP(AB48,X48:Z55,2)","v":{"$error":"#NUM!"}},{"$f":"VLOOKUP(AB48,X48:Z55,3)","v":{"$error":"#NUM!"}},"PRO1:",{"$f":"IF(AM8=AM9, AC48, FORECAST(AM7,$AC$48:$AD$48,$AM$8:$AM$9))","v":{"$error":"#NUM!"}}]
[null,null,null,null,100,88,82,76,72,69,66,61,56,45,31,null,null,null,null,100,88,null,null,{"$f":"E49","v":100},{"$f":"HLOOKUP($AM$8,$F$46:$Q$55,4)","v":88},{"$f":"HLOOKUP($AM$9,$F$46:$Q$55,4)","v":88},"PRI2:",{"$f":"SMALL(X48:X55,COUNTIF(X48:X55,\"<\" &AM6)+1)","v":50},{"$f":"VLOOKUP(AB49,X48:Z55,2)","v":50},{"$f":"VLOOKUP(AB49,X48:Z55,3)","v":50},"PRO2:",{"$f":"IF(AM8=AM9, AC49, FORECAST(AM7,$AC$49:$AD$49,$AM$8:$AM$9))","v":50}]
[null,null,null,null,150,108,102,96,93,90,87,85,79,75,66,59,44,null,null,150,108,null,null,150,{"$f":"HLOOKUP($AM$8,$F$46:$Q$55,5)","v":108},{"$f":"HLOOKUP($AM$9,$F$46:$Q$55,5)","v":108},"PSI1:",{"$f":"LARGE(X48:X55,COUNTIF(X48:X55,\">\" &AM5)+1)","v":{"$error":"#NUM!"}},null,null,"PSO1:",{"$f":"VLOOKUP(AB50,T48:U55,2)","v":{"$error":"#NUM!"}}]
[null,null,null,null,200,128,122,116,114,114,111,108,102,97,91,85,76,null,null,200,128,null,null,200,{"$f":"HLOOKUP($AM$8,$F$46:$Q$55,6)","v":128},{"$f":"HLOOKUP($AM$9,$F$46:$Q$55,6)","v":128},"PSI2:",{"$f":"SMALL(X48:X55,COUNTIF(X48:X55,\"<\" &AM5)+1)","v":50},null,null,"PSO2:",{"$f":"VLOOKUP(AB51,T48:U55,2)","v":50}]
[null,null,null,null,250,147,141,136,134,132,131,126,123,119,115,109,102,null,null,{"$f":"E52","v":250},{"$f":"F52","v":147},null,null,250,{"$f":"HLOOKUP($AM$8,$F$46:$Q$55,7)","v":147},{"$f":"HLOOKUP($AM$9,$F$46:$Q$55,7)","v":147}]
[null,null,null,null,300,166,161,157,155,154,152,146,142,139,136,129,124,null,null,{"$f":"E53","v":300},{"$f":"F53","v":166},null,null,300,{"$f":"HLOOKUP($AM$8,$F$46:$Q$55,8)","v":166},{"$f":"HLOOKUP($AM$9,$F$46:$Q$55,8)","v":166}]
[null,null,null,null,315,172,164,160,157,160,155,152,149,146,142,136,131,null,null,315,{"$f":"F54","v":172},null,null,315,{"$f":"HLOOKUP($AM$8,$F$46:$Q$55,9)","v":172},{"$f":"HLOOKUP($AM$9,$F$46:$Q$55,9)","v":172}]
[null,null,null,null,null,null,null,null,null,null,null,null,null,null,null,null,null,null,null,400,{"$f":"U53+(((U54-U53)/(T54-T53))*(T55-T53))","v":206},null,null,400,{"$f":"Y53+(((Y54-Y53)/(X54-X53))*(X55-X53))","v":206},{"$f":"Z53+(((Z54-Z53)/(X54-X53))*(X55-X53))","v":206}]
[]
[]
[null,null,null,null,"Residual ","Static"]
[null,null,null,"Bonnet Setting","Inlet Pressure psig","OUTLET PRESSURES @ FLOW RATE, GPM",null,null,null,null,null,null,null,null,null,null,null,null,null,"Setting # 5: Inlet Pressure",null,null,null,"SETTING 5"]
[null,null,null,null,null,0,50,100,150,175,200,250,300,350,400,450,500,null,null,"Inlet (psig)","Static",null,null,"Inlet (psig)",{"$f":"CONCATENATE(\"Outlet Residual @ \" &AM$8& \" GPM\")","v":"Outlet Residual @ 0 GPM"},{"$f":"CONCATENATE(\"Outlet Residual @ \" &AM$9& \" GPM\")","v":"Outlet Residual @ 0 GPM"},null,null,"Const. PRI Interpolated @ Var. Flow"]
[null,null,null,5,0,0,0,0,0,0,0,0,0,0,0,0,0,null,null,{"$f":"E61","v":0},{"$f":"F61","v":0}]
[null,null,null,null,50,50,49,46,40,35,31,23,13,null,null,null,null,null,null,{"$f":"E62","v":50},{"$f":"F62","v":50},null,null,{"$f":"E62","v":50},{"$f":"HLOOKUP($AM$8,$F$60:$Q$69,3)","v":50},{"$f":"HLOOKUP($AM$9,$F$60:$Q$69,3)","v":50},"PRI1:",{"$f":"LARGE(X62:X69,COUNTIF(X62:X69,\">\" &AM6)+1)","v":{"$error":"#NUM!"}},{"$f":"VLOOKUP(AB62,X62:Z69,2)","v":{"$error":"#NUM!"}},{"$f":"VLOOKUP(AB62,X62:Z69,3)","v":{"$error":"#NUM!"}},"PRO1:",{"$f":"IF(AM8=AM9, AC62, FORECAST(AM7,$AC$62:$AD$62,$AM$8:$AM$9))","v":{"$error":"#NUM!"}}]
[null,null,null,null,100,97,93,85,81,78,75,66,61,47,34,null,null,null,null,100,97,null,null,{"$f":"E63","v":100},{"$f":"HLOOKUP($AM$8,$F$60:$Q$69,4)","v":97},{"$f":"HLOOKUP($AM$9,$F$60:$Q$69,4)","v":97},"PRI2:",{"$f":"SMALL(X62:X69,COUNTIF(X62:X69,\"<\" &AM6)+1)","v":50},{"$f":"VLOOKUP(AB63,X62:Z69,2)","v":50},{"$f":"VLOOKUP(AB63,X62:Z69,3)","v":50},"PRO2:",{"$f":"IF(AM8=AM9, AC63, FORECAST(AM7,$AC$63:$AD$63,$AM$8:$AM$9))","v":50}]
[null,null,null,null,150,121,115,110,106,106,102,96,91,84,76,66,47,null,null,150,121,null,null,150,{"$f":"HLOOKUP($AM$8,$F$60:$Q$69,5)","v":121},{"$f":"HLOOKUP($AM$9,$F$60:$Q$69,5)","v":121},"PSI1:",{"$f":"LARGE(X62:X69,COUNTIF(X62:X69,\">\" &AM5)+1)","v":{"$error":"#NUM!"}},null,null,"PSO1:",{"$f":"VLOOKUP(AB64,T62:U69,2)","v":{"$error":"#NUM!"}}]
[null,null,null,null,200,141,136,128,125,125,121,119,115,110,102,95,87,null,null,200,141,null,null,200,{"$f":"HLOOKUP($AM$8,$F$60:$Q$69,6)","v":141},{"$f":"HLOOKUP($AM$9,$F$60:$Q$69,6)","v":141},"PSI2:",{"$f":"SMALL(X62:X69,COUNTIF(X62:X69,\"<\" &AM5)+1)","v":50},null,null,"PSO2:",{"$f":"VLOOKUP(AB65,T62:U69,2)","v":50}]
[null,null,null,null,250,162,155,149,147,144,148,141,136,131,127,122,115,null,null,{"$f":"E66","v":250},{"$f":"F66","v":162},null,null,250,{"$f":"HLOOKUP($AM$8,$F$60:$Q$69,7)","v":162},{"$f":"HLOOKUP($AM$9,$F$60:$Q$69,7)","v":162}]
[null,null,null,null,280,174,167,160,159,156,158,152,148,144,140,134,128,null,null,{"$f":"E67","v":280},{"$f":"F67","v":174},null,null,280,{"$f":"HLOOKUP($AM$8,$F$60:$Q$69,8)","v":174},{"$f":"HLOOKUP($AM$9,$F$60:$Q$69,8)","v":174}]
[null,null,null,null,null,null,null,null,null,null,null,null,null,null,null,null,null,null,null,300,{"$f":"U66+(((U67-U66)/(T67-T66))*(T68-T66))","v":182},null,null,350,{"$f":"Y66+(((Y67-Y66)/(X67-X66))*(X68-X66))","v":202},{"$f":"Z66+(((Z67-Z66)/(X67-X66))*(X68-X66))","v":202}]
[null,null,null,null,null,null,null,null,null,null,null,null,null,null,null,null,null,null,null,400,{"$f":"U67+(((U68-U67)/(T68-T67))*(T69-T67))","v":222},null,null,400,{"$f":"Y67+(((Y68-Y67)/(X68-X67))*(X69-X67))","v":222},{"$f":"Z67+(((Z68-Z67)/(X68-X67))*(X69-X67))","v":222}]
[]
[]
[null,null,null,null,"Residual ","Static"]
[null,null,null,"Bonnet Setting","Inlet Pressure psig","OUTLET PRESSURES @ FLOW RATE, GPM",null,null,null,null,null,null,null,null,null,null,null,null,null,"Setting # 6: Inlet Pressure",null,null,null,"SETTING 6"]
[null,null,null,null,null,0,50,100,150,175,200,250,300,350,400,450,500,null,null,"Inlet (psig)","Static",null,null,"Inlet (psig)",{"$f":"CONCATENATE(\"Outlet Residual @ \" &AM$8& \" GPM\")","v":"Outlet Residual @ 0 GPM"},{"$f":"CONCATENATE(\"Outlet Residual @ \" &AM$9& \" GPM\")","v":"Outlet Residual @ 0 GPM"},null,null,"Const. PRI Interpolated @ Var. Flow"]
[null,null,null,6,0,0,0,0,0,0,0,0,0,0,0,0,0,null,null,{"$f":"E75","v":0},{"$f":"F75","v":0}]
[null,null,null,null,50,50,48,45,40,38,32,24,11,null,null,null,null,null,null,{"$f":"E76","v":50},{"$f":"F76","v":50},null,null,{"$f":"E76","v":50},{"$f":"HLOOKUP($AM$8,$F$74:$Q$83,3)","v":50},{"$f":"HLOOKUP($AM$9,$F$74:$Q$83,3)","v":50},"PRI1:",{"$f":"LARGE(X76:X83,COUNTIF(X76:X83,\">\" &AM6)+1)","v":{"$error":"#NUM!"}},{"$f":"VLOOKUP(AB76,X76:Z83,2)","v":{"$error":"#NUM!"}},{"$f":"VLOOKUP(AB76,X76:Z83,3)","v":{"$error":"#NUM!"}},"PRO1:",{"$f":"IF(AM8=AM9, AC76, FORECAST(AM7,$AC$76:$AD$76,$AM$8:$AM$9))","v":{"$error":"#NUM!"}}]
[null,null,null,null,100,100,98,94,90,85,82,74,63,47,34,null,null,null,null,100,100,null,null,{"$f":"E77","v":100},{"$f":"HLOOKUP($AM$8,$F$74:$Q$83,4)","v":100},{"$f":"HLOOKUP($AM$9,$F$74:$Q$83,4)","v":100},"PRI2:",{"$f":"SMALL(X76:X83,COUNTIF(X76:X83,\"<\" &AM6)+1)","v":50},{"$f":"VLOOKUP(AB77,X76:Z83,2)","v":50},{"$f":"VLOOKUP(AB77,X76:Z83,3)","v":50},"PRO2:",{"$f":"IF(AM8=AM9, AC77, FORECAST(AM7,$AC$77:$AD$77,$AM$8:$AM$9))","v":50}]
[null,null,null,null,150,138,130,124,121,119,116,110,102,95,82,65,47,null,null,150,138,null,null,150,{"$f":"HLOOKUP($AM$8,$F$74:$Q$83,5)","v":138},{"$f":"HLOOKUP($AM$9,$F$74:$Q$83,5)","v":138},"PSI1:",{"$f":"LARGE(X76:X83,COUNTIF(X76:X83,\">\" &AM5)+1)","v":{"$error":"#NUM!"}},null,null,"PSO1:",{"$f":"VLOOKUP(AB78,T76:U83,2)","v":{"$error":"#NUM!"}}]
[null,null,null,null,200,155,152,145,144,141,140,133,129,123,116,106,95,null,null,200,{"$f":"F79","v":155},null,null,200,{"$f":"HLOOKUP($AM$8,$F$74:$Q$83,6)","v":155},{"$f":"HLOOKUP($AM$9,$F$74:$Q$83,6)","v":155},"PSI2:",{"$f":"SMALL(X76:X83,COUNTIF(X76:X83,\"<\" &AM5)+1)","v":50},null,null,"PSO2:",{"$f":"VLOOKUP(AB79,T76:U83,2)","v":50}]
[null,null,null,null,240,174,167,161,158,157,157,153,148,142,136,129,120,null,null,{"$f":"E80","v":240},{"$f":"F80","v":174},null,null,240,{"$f":"HLOOKUP($AM$8,$F$74:$Q$83,7)","v":174},{"$f":"HLOOKUP($AM$9,$F$74:$Q$83,7)","v":174}]
[null,null,null,null,null,null,null,null,null,null,null,null,null,null,null,null,null,null,null,300,{"$f":"U79+(((U80-U79)/(T80-T79))*(T81-T79))","v":202.5},null,null,300,{"$f":"Y79+(((Y80-Y79)/(X80-X79))*(X81-X79))","v":202.5},{"$f":"Z79+(((Z80-Z79)/(X80-X79))*(X81-X79))","v":202.5}]
[null,null,null,null,null,null,null,null,null,null,null,null,null,null,null,null,null,null,null,350,{"$f":"U80+(((U81-U80)/(T81-T80))*(T82-T80))","v":226.25},null,null,350,{"$f":"Y80+(((Y81-Y80)/(X81-X80))*(X82-X80))","v":226.25},{"$f":"Z80+(((Z81-Z80)/(X81-X80))*(X82-X80))","v":226.25}]
[null,null,null,null,null,null,null,null,null,null,null,null,null,null,null,null,null,null,null,400,{"$f":"U81+(((U82-U81)/(T82-T81))*(T83-T81))","v":250},null,null,400,250,250]
[]
[]
[null,null,null,null,"Residual ","Static"]
[null,null,null,"Bonnet Setting","Inlet Pressure psig","OUTLET PRESSURES @ FLOW RATE, GPM",null,null,null,null,null,null,null,null,null,null,null,null,null,"Setting # 7: Inlet Pressure",null,null,null,"SETTING 7"]
[null,null,null,null,null,0,50,100,150,175,200,250,300,350,400,450,500,null,null,"Inlet (psig)","Static",null,null,"Inlet (psig)",{"$f":"CONCATENATE(\"Outlet Residual @ \" &AM$8& \" GPM\")","v":"Outlet Residual @ 0 GPM"},{"$f":"CONCATENATE(\"Outlet Residual @ \" &AM$9& \" GPM\")","v":"Outlet Residual @ 0 GPM"},null,null,"Const. PRI Interpolated @ Var. Flow"]
[null,null,null,7,0,0,0,0,0,0,0,0,0,0,0,0,0,null,null,{"$f":"E89","v":0},0]
[null,null,null,null,50,49,48,44,41,37,34,25,16,null,null,null,null,null,null,50,49,null,null,{"$f":"E90","v":50},{"$f":"HLOOKUP($AM$8,$F$74:$Q$83,3)","v":50},{"$f":"HLOOKUP($AM$9,$F$74:$Q$83,3)","v":50},"PRI1:",{"$f":"LARGE(X90:X97,COUNTIF(X90:X97,\">\" &AM6)+1)","v":{"$error":"#NUM!"}},{"$f":"VLOOKUP(AB90,X90:Z97,2)","v":{"$error":"#NUM!"}},{"$f":"VLOOKUP(AB90,X90:Z97,3)","v":{"$error":"#NUM!"}},"PRO1:",{"$f":"IF(AM22=AM23, AC90, FORECAST(AM21,$AC$90:$AD$90,$AM$8:$AM$9))","v":{"$error":"#NUM!"}}]
[null,null,null,null,100,98,97,95,88,87,83,73,66,54,42,29,null,null,null,100,98,null,null,{"$f":"E91","v":100},{"$f":"HLOOKUP($AM$8,$F$74:$Q$83,4)","v":100},{"$f":"HLOOKUP($AM$9,$F$74:$Q$83,4)","v":100},"PRI2:",{"$f":"SMALL(X90:X97,COUNTIF(X90:X97,\"<\" &AM6)+1)","v":50},{"$f":"VLOOKUP(AB91,X90:Z97,2)","v":50},{"$f":"VLOOKUP(AB91,X90:Z97,3)","v":50},"PRO2:",{"$f":"IF(AM22=AM23, AC91, FORECAST(AM21,$AC$91:$AD$91,$AM$8:$AM$9))","v":50}]
[null,null,null,null,150,143,138,125,122,118,114,107,105,96,89,77,60,null,null,{"$f":"E92","v":150},143,null,null,150,{"$f":"HLOOKUP($AM$8,$F$74:$Q$83,5)","v":138},{"$f":"HLOOKUP($AM$9,$F$74:$Q$83,5)","v":138},"PSI1:",{"$f":"LARGE(X90:X97,COUNTIF(X90:X97,\">\" &AM5)+1)","v":{"$error":"#NUM!"}},null,null,"PSO1:",{"$f":"VLOOKUP(AB92,T90:U97,2)","v":{"$error":"#NUM!"}}]
[null,null,null,null,175,158,150,138,136,130,127,128,118,113,100,94,83,null,null,{"$f":"E93","v":175},{"$f":"F93","v":158},null,null,175,{"$f":"HLOOKUP($AM$8,$F$74:$Q$83,6)","v":155},{"$f":"HLOOKUP($AM$9,$F$74:$Q$83,6)","v":155},"PSI2:",{"$f":"SMALL(X90:X97,COUNTIF(X90:X97,\"<\" &AM5)+1)","v":50},null,null,"PSO2:",{"$f":"VLOOKUP(AB93,T90:U97,2)","v":49}]
[null,null,null,null,null,null,null,null,null,null,null,null,null,null,null,null,null,null,null,200,{"$f":"U92+(((U93-U92)/(T93-T92))*(T94-T92))","v":173},null,null,250,{"$f":"Y92+(((Y93-Y92)/(X93-X92))*(X94-X92))","v":206},{"$f":"Z92+(((Z93-Z92)/(X93-X92))*(X94-X92))","v":206}]
[null,null,null,null,null,null,null,null,null,null,null,null,null,null,null,null,null,null,null,250,{"$f":"U93+(((U94-U93)/(T94-T93))*(T95-T93))","v":203},null,null,300,{"$f":"Y93+(((Y94-Y93)/(X94-X93))*(X95-X93))","v":240},{"$f":"Z93+(((Z94-Z93)/(X94-X93))*(X95-X93))","v":240}]
[null,null,null,null,null,null,null,null,null,null,null,null,null,null,null,null,null,null,null,350,{"$f":"U94+(((U95-U94)/(T95-T94))*(T96-T94))","v":263},null,null,350,274,274]
[null,null,null,null,null,null,null,null,null,null,null,null,null,null,null,null,null,null,null,400,{"$f":"U95+(((U96-U95)/(T96-T95))*(T97-T95))","v":293},null,null,400,308,308]

{"sheet":"Charts 2.5\" Straight","index":11,"n_rows":2,"n_cols":2,"rows_kept":2,"cut":false,"hidden":false,"merged":[[1,1,2,7]]}
[]
[null,"2.5\" STRAIGHT"]

{"sheet":"Charts 1.5 Angle","index":12,"n_rows":2,"n_cols":2,"rows_kept":2,"cut":false,"hidden":true,"merged":[[1,1,2,7]]}
[]
[null,"1.5\" ANGLE"]

{"sheet":"Conditions","index":13,"n_rows":17,"n_cols":2,"rows_kept":17,"cut":false,"hidden":true,"merged":[]}
[]
[]
[null,"Conditions applied to the \"Order_Entry\" sheet"]
[]
[1,"Any changes to \"Flow Rate\" clears all other operating conditions "]
[2,"Static Inlet Pressure can't be less than Residual Inlet Pressure"]
[3,"Static Inlet Pressure can't be equal to Residual Inlet Pressure"]
[4,"When static outlet status, residual outlet status and flow status conditions are met, the result is \"Available\""]
[5,"Valve outputs with \"Not As Per NFPA\" status can still be added to the order sheet with pop-up and selecting \"Yes\""]
[6,"Any changes to operating conditions clears location tags"]
[7,"Any changes to \"Static Inlet Pressure\" will clear Residual Inlet Pressure, Desired Residual Outlet Pressure and Location Tag"]
[8,"If one attempts to enter in a second quantity line, the previous entry is removed. "]
[]
[]
[]
[null,"Conditions for DATA Chart"]
[1,"cannot have a blank cell between other bits of data.  Must extrapolate"]

{"sheet":"Old 2.5\" Charts","index":14,"n_rows":4,"n_cols":20,"rows_kept":4,"cut":false,"hidden":true,"merged":[[3,4,3,7],[2,19,2,22]]}
[]
[]
[null,null,null,null,null,null,null,null,null,null,null,null,null,null,null,null,null,null,null,"STRAIGHT - 2.5\""]
[null,null,null,null,"ANGLE - 2.5\""]

{"sheet":"1.5\" Data (25psi increment)","index":15,"n_rows":114,"n_cols":15,"rows_kept":114,"cut":false,"hidden":true,"merged":[[99,1,113,1],[78,1,79,1],[78,2,79,2],[78,3,78,14],[80,1,94,1],[97,1,98,1],[97,2,98,2],[97,3,97,14],[42,1,56,1],[59,1,60,1],[59,2,60,2],[59,3,59,14],[61,1,75,1],[21,1,22,1],[21,2,22,2],[21,3,21,14],[23,1,37,1],[40,1,41,1],[40,2,41,2],[40,3,40,14],[0,1,0,7],[2,1,3,1],[2,2,3,2],[2,3,2,14],[4,1,18,1]]}
[null,"1.5\" DATA AT 50 PSI INCRIMENT"]
[]
[null,"Bonnet Setting","Inlet Pressure psig","OUTLET PRESSURES @ FLOW RATE, GPM"]
[null,null,null,0,50,100,150,175,200,250,300,350,400,450,500]
[null,1,50,52,47,38,25,18,14]
[null,null,75,76,70,56,41,33,24]
[null,null,100,99,85,67,55,45,35,20]
[null,null,125,112,91,75,58,57,43,25]
[null,null,150,117,99,83,71,60,54,31]
[null,null,175,122,109,91,74,70,61,38]
[null,null,200,129,122,97,80,72,63,47,28]
[null,null,225,142,124,105,88,83,72,54,33]
[null,null,250,150,133,112,95,87,80,62,42]
[null,null,275,153,143,125,101,98,86,72,50]
[null,null,300,158,150,127,107,100,93,76,57,36]
[null,null,325,173,157,134,115,107,98,82,64,41]
[null,null,350,174,165,140,121,118,109,89,68,48]
[null,null,375,182,166,148,128,120,115,95,76,52]
[null,null,400,187,179,152,133,128,119,102,84,63]
[]
[]
[null,"Bonnet Setting","Inlet Pressure psig","OUTLET PRESSURES @ FLOW RATE, GPM"]
[null,null,null,0,50,100,150,175,200,250,300,350,400,450,500]
[null,2,50,53,49,42,30,23,14]
[null,null,75,77,72,62,50,42,34,18]
[null,null,100,102,93,79,65,55,47,31]
[null,null,125,126,107,89,73,72,62,39]
[null,null,150,130,115,97,82,74,65,46,27]
[null,null,175,140,122,104,90,80,72,51,32]
[null,null,200,150,136,113,96,93,79,60,38]
[null,null,225,151,142,118,103,95,86,68,45]
[null,null,250,165,150,132,109,101,93,74,53]
[null,null,275,170,157,135,117,108,99,82,63,40]
[null,null,300,179,159,141,122,114,104,88,70,45]
[null,null,325,186,172,147,130,120,111,94,76,51]
[null,null,350,189,175,156,135,126,119,100,82,58]
[null,null,375,203,184,161,142,134,128,108,87,66]
[null,null,400,208,193,168,154,144,135,115,95,72,50]
[]
[]
[null,"Bonnet Setting","Inlet Pressure psig","OUTLET PRESSURES @ FLOW RATE, GPM"]
[null,null,null,0,50,100,150,175,200,250,300,350,400,450,500]
[null,3,50,52,49,42,29,22,15]
[null,null,75,77,74,67,55,47,38,19]
[null,null,100,102,99,89,76,68,60,43,23]
[null,null,125,128,120,107,90,84,74,57,40]
[null,null,150,148,134,118,101,95,85,68,50]
[null,null,175,163,147,128,116,107,93,75,54,36]
[null,null,200,171,150,134,118,110,101,82,61,41]
[null,null,225,177,166,142,125,118,107,88,64,44]
[null,null,250,188,167,155,132,123,121,94,72,51]
[null,null,275,194,180,156,138,130,122,101,78,55]
[null,null,300,203,181,162,146,136,134,109,91,63]
[null,null,325,207,194,170,153,149,135,115,97,72,50]
[null,null,350,215,201,178,165,150,141,120,104,79,56]
[null,null,375,224,208,186,171,158,147,129,110,85,64]
[null,null,400,247,210,192,172,162,155,136,115,94,85]
[]
[]
[null,"Bonnet Setting","Inlet Pressure psig","OUTLET PRESSURES @ FLOW RATE, GPM"]
[null,null,null,0,50,100,150,175,200,250,300,350,400,450,500]
[null,4,50,52,49,41,29,23,14]
[null,null,75,77,75,67,54,46,39,20]
[null,null,100,102,100,92,78,72,62,42,24]
[null,null,125,126,124,115,102,96,87,65,42]
[null,null,150,152,146,133,121,110,103,83,64,38]
[null,null,175,175,166,152,131,128,113,95,78,56,41]
[null,null,200,193,176,157,141,131,123,105,82,64,45]
[null,null,225,203,184,164,149,141,129,116,90,70,47]
[null,null,250,210,192,172,156,152,145,115,96,73,50]
[null,null,275,215,198,180,164,159,147,125,101,78,56]
[null,null,300,219,212,194,172,168,151,131,111,85,59]
[null,null,325,230,215,195,175,169,165,140,117,90,67]
[null,null,350,237,226,202,182,175,166,145,123,97,72]
[null,null,375,246,227,209,189,179,170,152,131,106,77,56]
[null,null,400,252,234,218,197,193,175,155,135,108,83,62]
[]
[]
[null,"Bonnet Setting","Inlet Pressure psig","OUTLET PRESSURES @ FLOW RATE, GPM"]
[null,null,null,0,50,100,150,175,200,250,300,350,400,450,500]
[null,5,50,52,49,42,30,23,15]
[null,null,75,77,74,67,55,46,38,18]
[null,null,100,101,100,92,80,71,61,42]
[null,null,125,126,124,116,105,96,87,67,42]
[null,null,150,151,149,141,129,123,113,90,62,38]
[null,null,175,177,173,163,146,143,129,109,86,60]
[null,null,200,200,194,174,158,150,141,123,104,84,53]
[null,null,225,226,205,187,171,162,153,131,114,95,75]
[null,null,250,251,224,195,178,168,164,138,119,99,82,56]
[null,null,275,274,231,208,184,174,171,145,125,115,83,60]
[null,null,300,299,250,209,192,183,177,155,130,109,85,62]
[null,null,325,326,265,219,200,190,182,158,143,110,89,65]
[null,null,350,343,284,224,205,196,186,169,144,121,98,67]
[null,null,375,370,314,233,213,211,192,172,151,123,99,82]
[null,null,400,379,330,239,218,213,211,178,158,130,102,77]
[]
[]
[null,"Bonnet Setting","Inlet Pressure psig","OUTLET PRESSURES @ FLOW RATE, GPM"]
[null,null,null,0,50,100,150,175,200,250,300,350,400,450,500]
[null,6,50,53,50,42,30,24,15]
[null,null,75,77,74,67,55,47,38,20]
[null,null,100,101,99,92,79,72,63,43]
[null,null,125,127,124,117,105,96,88,67,42]
[null,null,150,152,150,143,130,123,112,91,66,35]
[null,null,175,178,174,167,154,148,138,116,90,60]
[null,null,200,201,197,185,173,164,153,138,113,90,53]
[null,null,225,226,219,202,188,175,172,147,128,108,75]
[null,null,250,251,221,203,189,177,175,148,130,110,79]
[null,null,275,275,268,247,215,199,191,165,144,123,101,72]
[null,null,300,300,291,272,240,224,200,174,150,127,105,86]
[null,null,325,326,319,296,259,240,218,181,155,132,109,88]
[null,null,350,352,344,321,284,259,242,191,162,140,114,89]
[null,null,375,375,368,345,310,286,262,206,171,145,118,94]
[null,null,400,401,391,369,325,309,275,223,177,152,123,96,65]

{"sheet":"IE2600A-150-DATA","index":16,"n_rows":83,"n_cols":39,"rows_kept":83,"cut":false,"hidden":true,"merged":[[72,23,72,31],[73,23,74,23],[73,24,74,24],[73,25,74,25],[73,28,74,29],[74,3,82,3],[72,19,72,20],[60,3,68,3],[72,3,73,3],[72,4,73,4],[72,5,72,16],[58,3,59,3],[58,4,59,4],[58,5,58,16],[58,19,58,20],[58,23,58,31],[59,23,60,23],[59,24,60,24],[59,25,60,25],[59,28,60,29],[44,23,44,31],[45,23,46,23],[45,24,46,24],[45,25,46,25],[45,28,46,29],[46,3,54,3],[32,3,40,3],[44,3,45,3],[44,4,45,4],[44,5,44,16],[44,19,44,20],[30,3,31,3],[30,4,31,4],[30,5,30,16],[30,19,30,20],[21,34,21,35],[22,34,22,35],[23,34,23,35],[30,23,30,31],[31,23,32,23],[31,24,32,24],[31,25,32,25],[31,28,32,29],[16,3,17,3],[16,4,17,4],[16,5,16,16],[16,19,16,20],[7,34,7,36],[8,34,8,36],[16,23,16,31],[17,23,18,23],[17,24,18,24],[17,25,18,25],[17,28,18,29],[17,34,17,35],[18,3,26,3],[18,34,18,35],[19,34,19,35],[20,34,20,35],[3,34,3,38],[0,0,0,16],[2,3,3,3],[2,4,3,4],[2,5,2,16],[2,19,2,20],[2,23,2,31],[3,23,4,23],[3,24,4,24],[3,25,4,25],[3,28,4,29],[4,3,12,3],[4,34,4,36],[5,34,5,36],[6,34,6,36],[0,17,0,20]]}
["Data from Project# 4789893180, Date: 2021-06-29",null,null,null,null,null,null,null,null,null,null,null,null,null,null,null,null,"Double click this icon to open UL results "]
[null,null,null,null,"Residual ","Static"]
[null,null,null,"Bonnet Setting","Inlet Pressure psig","OUTLET PRESSURES @ FLOW RATE, GPM",null,null,null,null,null,null,null,null,null,null,null,null,null,"Setting # 1: Inlet Pressure",null,null,null,"SETTING 1"]
[null,null,null,null,null,0,50,100,150,175,200,250,300,350,400,450,500,null,null,"Inlet (psig)","Static",null,null,"Inlet (psig)",{"$f":"CONCATENATE(\"Outlet Residual @ \" &AM$8& \" GPM\")","v":"Outlet Residual @ 0 GPM"},{"$f":"CONCATENATE(\"Outlet Residual @ \" &AM$9& \" GPM\")","v":"Outlet Residual @ 0 GPM"},null,null,"Const. PRI Interpolated @ Var. Flow",null,null,null,null,null,"VARIABLES"]
[null,null,null,1,0,0,0,0,0,0,0,0,0,0,0,0,0,null,null,{"$f":"E5","v":0},0,null,null,null,null,null,null,null,null,null,null,null,null,null,"Static Inlet Pressure",null,null,"PSI:",{"$f":"Database!$E$2","v":0}]
[null,null,null,null,50,52,47,38,25,18,14,null,null,null,null,null,null,null,null,{"$f":"E6","v":50},{"$f":"F6","v":52},null,null,{"$f":"E6","v":50},{"$f":"HLOOKUP($AM$8,$F$4:$Q$13,3)","v":52},{"$f":"HLOOKUP($AM$9,$F$4:$Q$13,3)","v":52},"PRI1:",{"$f":"LARGE(E6:E13,COUNTIF(E6:E13,\">\" &AM6)+1)","v":{"$error":"#NUM!"}},{"$f":"VLOOKUP(AB6,X6:Z13,2)","v":{"$error":"#NUM!"}},{"$f":"VLOOKUP(AB6,X6:Z13,3)","v":{"$error":"#NUM!"}},"PRO1:",{"$f":"IF(AM8=AM9, AC6, FORECAST(AM7,$AC$6:$AD$6,$AM$8:$AM$9))","v":{"$error":"#NUM!"}},null,null,"Residual Inlet Pressure",null,null,"PRI:",{"$f":"Database!$E$3","v":0}]
[null,null,null,null,100,99,85,67,55,45,35,20,null,null,null,null,null,null,null,100,99,null,null,{"$f":"E7","v":100},{"$f":"HLOOKUP($AM$8,$F$4:$Q$13,4)","v":99},{"$f":"HLOOKUP($AM$9,$F$4:$Q$13,4)","v":99},"PRI2:",{"$f":"SMALL(E6:E13,COUNTIF(E6:E13,\"<\" &AM6)+1)","v":50},{"$f":"VLOOKUP(AB7,X6:Z13,2)","v":52},{"$f":"VLOOKUP(AB7,X6:Z13,3)","v":52},"PRO2:",{"$f":"IF(AM8=AM9, AC7, FORECAST(AM7,$AC$7:$AD$7,$AM$8:$AM$9))","v":52},null,null,"Flow Rate",null,null,"Q0:",{"$f":"IF(Database!$E$4=500,499.99,Database!$E$4)","v":0}]
[null,null,null,null,150,117,99,83,71,60,54,31,null,null,null,null,null,null,null,150,117,null,null,150,{"$f":"HLOOKUP($AM$8,$F$4:$Q$13,5)","v":117},{"$f":"HLOOKUP($AM$9,$F$4:$Q$13,5)","v":117},"PSI1:",{"$f":"LARGE(E6:E13,COUNTIF(E6:E13,\">\" &AM5)+1)","v":{"$error":"#NUM!"}},null,null,"PSO1:",{"$f":"VLOOKUP(AB8,E6:F13,2)","v":{"$error":"#NUM!"}},null,null,"Nearest known Flow Rate, 1",null,null,"Q1:",{"$f":"LARGE(F4:Q4,COUNTIF(F4:Q4,\">\" &AM7)+1)","v":0}]
[null,null,null,null,200,129,122,97,80,72,63,47,28,null,null,null,null,null,null,200,129,null,null,200,{"$f":"HLOOKUP($AM$8,$F$4:$Q$13,6)","v":129},{"$f":"HLOOKUP($AM$9,$F$4:$Q$13,6)","v":129},"PSI2:",{"$f":"SMALL(E6:E13,COUNTIF(E6:E13,\"<\" &AM5)+1)","v":50},null,null,"PSO2:",{"$f":"VLOOKUP(AB9,E6:F13,2)","v":52},null,null,"Nearest known Flow Rate, 2",null,null,"Q2:",{"$f":"SMALL(F4:Q4,COUNTIF(F4:Q4,\"<\" &AM7)+1)","v":0}]
[null,null,null,null,250,150,133,112,95,87,80,62,42,null,null,null,null,null,null,250,150,null,null,250,{"$f":"HLOOKUP($AM$8,$F$4:$Q$13,7)","v":150},{"$f":"HLOOKUP($AM$9,$F$4:$Q$13,7)","v":150}]
[null,null,null,null,300,158,150,127,107,100,93,76,57,36,null,null,null,null,null,300,158,null,null,300,{"$f":"HLOOKUP($AM$8,$F$4:$Q$13,8)","v":158},{"$f":"HLOOKUP($AM$9,$F$4:$Q$13,8)","v":158}]
[null,null,null,null,350,174,165,140,121,118,109,89,68,48,null,null,null,null,null,340,{"$f":"F12","v":174},null,null,350,{"$f":"HLOOKUP($AM$8,$F$4:$Q$13,9)","v":174},{"$f":"HLOOKUP($AM$9,$F$4:$Q$13,9)","v":174}]
[null,null,null,null,400,187,179,152,133,128,119,102,84,63,null,null,null,null,null,400,{"$f":"F13","v":187},null,null,400,{"$f":"HLOOKUP($AM$8,$F$4:$Q$13,10)","v":187},{"$f":"HLOOKUP($AM$9,$F$4:$Q$13,10)","v":187}]
[]
[]
[null,null,null,null,"Residual ","Static"]
[null,null,null,"Bonnet Setting","Inlet Pressure psig","OUTLET PRESSURES @ FLOW RATE, GPM",null,null,null,null,null,null,null,null,null,null,null,null,null,"Setting # 2: Inlet Pressure ",null,null,null,"SETTING 2"]
[null,null,null,null,null,0,50,100,150,175,200,250,300,350,400,450,500,null,null,"Inlet (psig)","Static",null,null,"Inlet (psig)",{"$f":"CONCATENATE(\"Outlet Residual @ \" &AM$8& \" GPM\")","v":"Outlet Residual @ 0 GPM"},{"$f":"CONCATENATE(\"Outlet Residual @ \" &AM$9& \" GPM\")","v":"Outlet Residual @ 0 GPM"},null,null,"Const. PRI Interpolated @ Var. Flow",null,null,null,null,null,"2.5\" Angle Double Spring",null,"Calculated Static Outlet Pressure","Calculated Residual Outlet Pressure","Max Flow Rate"]
[null,null,null,2,0,0,0,0,0,0,0,0,0,0,0,0,0,null,null,{"$f":"E19","v":0},0,null,null,null,null,null,null,null,null,null,null,null,null,null,"Setting 1",null,{"$f":"IF($AF$8=$AF$9,$AF$8,FORECAST($AM$5,$AF$8:$AF$9,$AB$8:$AB$9))","v":{"$error":"#NUM!"}},{"$f":"IF($AF$6=$AF$7,$AF$6,FORECAST($AM$6,$AF$6:$AF$7,$AB$6:$AB$7))","v":{"$error":"#NUM!"}},300]
[null,null,null,null,50,53,49,42,30,23,14,null,null,null,null,null,null,null,null,{"$f":"E20","v":50},{"$f":"F20","v":53},null,null,{"$f":"E20","v":50},{"$f":"HLOOKUP($AM$8,$F$18:$Q$27,3)","v":53},{"$f":"HLOOKUP($AM$9,$F$18:$Q$27,3)","v":53},"PRI1:",{"$f":"LARGE(E20:E27,COUNTIF(E20:E27,\">\" &AM6)+1)","v":{"$error":"#NUM!"}},{"$f":"VLOOKUP(AB20,X20:Z27,2)","v":{"$error":"#NUM!"}},{"$f":"VLOOKUP(AB20,X20:Z27,3)","v":{"$error":"#NUM!"}},"PRO1:",{"$f":"IF(AM8=AM9, AC20, FORECAST(AM7,$AC$20:$AD$20,$AM$8:$AM$9))","v":{"$error":"#NUM!"}},null,null,"Setting 2",null,{"$f":"IF($AF$22=$AF$23,$AF$22,FORECAST($AM$5,$AF$22:$AF$23,$AB$22:$AB$23))","v":{"$error":"#NUM!"}},{"$f":"IF($AF$20=$AF$21,$AF$20,FORECAST($AM$6,$AF$20:$AF$21,$AB$20:$AB$21))","v":{"$error":"#NUM!"}},300]
[null,null,null,null,100,102,93,79,65,55,47,31,null,null,null,null,null,null,null,100,102,null,null,{"$f":"E21","v":100},{"$f":"HLOOKUP($AM$8,$F$18:$Q$27,4)","v":102},{"$f":"HLOOKUP($AM$9,$F$18:$Q$27,4)","v":102},"PRI2:",{"$f":"SMALL(E20:E27,COUNTIF(E20:E27,\"<\" &AM6)+1)","v":50},{"$f":"VLOOKUP(AB21,X20:Z27,2)","v":53},{"$f":"VLOOKUP(AB21,X20:Z27,3)","v":53},"PRO2:",{"$f":"IF(AM8=AM9, AC21, FORECAST(AM7,$AC$21:$AD$21,$AM$8:$AM$9))","v":53},null,null,"Setting 3",null,{"$f":"IF($AF$36=$AF$37,$AF$36,FORECAST($AM$5,$AF$36:$AF$37,$AB$36:$AB$37))","v":{"$error":"#NUM!"}},{"$f":"IF($AF$34=$AF$35,$AF$34,FORECAST($AM$6,$AF$34:$AF$35,$AB$34:$AB$35))","v":{"$error":"#NUM!"}},300]
[null,null,null,null,150,130,115,97,82,74,65,46,27,null,null,null,null,null,null,150,130,null,null,150,{"$f":"HLOOKUP($AM$8,$F$18:$Q$27,5)","v":130},{"$f":"HLOOKUP($AM$9,$F$18:$Q$27,5)","v":130},"PSI1:",{"$f":"LARGE(E20:E27,COUNTIF(E20:E27,\">\" &AM5)+1)","v":{"$error":"#NUM!"}},null,null,"PSO1:",{"$f":"VLOOKUP(AB22,E20:F27,2)","v":{"$error":"#NUM!"}},null,null,"Setting 4",null,{"$f":"IF($AF$50=$AF$51,$AF$50,FORECAST($AM$5,$AF$50:$AF$51,$AB$50:$AB$51))","v":{"$error":"#NUM!"}},{"$f":"IF($AF$48=$AF$49,$AF$48,FORECAST($AM$6,$AF$48:$AF$49,$AB$48:$AB$49))","v":{"$error":"#NUM!"}},300]
[null,null,null,null,200,150,136,113,96,93,79,60,38,null,null,null,null,null,null,200,150,null,null,200,{"$f":"HLOOKUP($AM$8,$F$18:$Q$27,6)","v":150},{"$f":"HLOOKUP($AM$9,$F$18:$Q$27,6)","v":150},"PSI2:",{"$f":"SMALL(E20:E27,COUNTIF(E20:E27,\"<\" &AM5)+1)","v":50},null,null,"PSO2:",{"$f":"VLOOKUP(AB23,E20:F27,2)","v":53},null,null,"Setting 5",null,{"$f":"IF($AF$64=$AF$65,$AF$64,FORECAST($AM$5,$AF$64:$AF$65,$AB$64:$AB$65))","v":{"$error":"#NUM!"}},{"$f":"IF($AF$62=$AF$63,$AF$62,FORECAST($AM$6,$AF$62:$AF$63,$AB$62:$AB$63))","v":{"$error":"#NUM!"}},300]
[null,null,null,null,250,165,150,132,109,101,93,74,53,null,null,null,null,null,null,250,165,null,null,250,{"$f":"HLOOKUP($AM$8,$F$18:$Q$27,7)","v":165},{"$f":"HLOOKUP($AM$9,$F$18:$Q$27,7)","v":165},null,null,null,null,null,null,null,null,"Setting 6",null,{"$f":"IF($AF$78=$AF$79,$AF$78,FORECAST($AM$5,$AF$78:$AF$79,$AB$78:$AB$79))","v":{"$error":"#NUM!"}},{"$f":"IF($AF$76=$AF$77,$AF$76,FORECAST($AM$6,$AF$76:$AF$77,$AB$76:$AB$77))","v":{"$error":"#NUM!"}},300]
[null,null,null,null,300,179,159,141,122,114,104,88,70,45,null,null,null,null,null,285,174,null,null,300,{"$f":"HLOOKUP($AM$8,$F$18:$Q$27,8)","v":179},{"$f":"HLOOKUP($AM$9,$F$18:$Q$27,8)","v":179}]
[null,null,null,null,350,189,175,156,135,126,119,100,82,58,null,null,null,null,null,300,{"$f":"F25","v":179},null,null,350,{"$f":"HLOOKUP($AM$8,$F$18:$Q$27,9)","v":189},{"$f":"HLOOKUP($AM$9,$F$18:$Q$27,9)","v":189}]
[null,null,null,null,400,208,193,168,154,144,135,115,95,72,50,null,null,null,null,400,208,null,null,400,{"$f":"HLOOKUP($AM$8,$F$18:$Q$27,10)","v":208},{"$f":"HLOOKUP($AM$9,$F$18:$Q$27,10)","v":208}]
[]
[]
[null,null,null,null,"Residual ","Static"]
[null,null,null,"Bonnet Setting","Inlet Pressure psig","OUTLET PRESSURES @ FLOW RATE, GPM",null,null,null,null,null,null,null,null,null,null,null,null,null,"Setting # 3: Inlet Pressure",null,null,null,"SETTING 3",null,null,null,null,null,null,null,null,null,null,"1.5\" Angle"]
[null,null,null,null,null,0,50,100,150,175,200,250,300,350,400,450,500,null,null,"Inlet (psig)","Static",null,null,"Inlet (psig)",{"$f":"CONCATENATE(\"Outlet Residual @ \" &AM$8& \" GPM\")","v":"Outlet Residual @ 0 GPM"},{"$f":"CONCATENATE(\"Outlet Residual @ \" &AM$9& \" GPM\")","v":"Outlet Residual @ 0 GPM"},null,null,"Const. PRI Interpolated @ Var. Flow",null,null,null,null,null,"2.5\" Angle"]
[null,null,null,3,0,0,0,0,0,0,0,0,0,0,0,0,0,null,null,{"$f":"E33","v":0},0,null,null,null,null,null,null,null,null,null,null,null,null,null,"2.5\" Inline"]
[null,null,null,null,50,52,49,42,29,22,15,null,null,null,null,null,null,null,null,{"$f":"E34","v":50},{"$f":"F34","v":52},null,null,{"$f":"E34","v":50},{"$f":"HLOOKUP($AM$8,$F$32:$Q$41,3)","v":52},{"$f":"HLOOKUP($AM$9,$F$32:$Q$41,3)","v":52},"PRI1:",{"$f":"LARGE(E34:E41,COUNTIF(E34:E41,\">\" &AM6)+1)","v":{"$error":"#NUM!"}},{"$f":"VLOOKUP(AB34,X34:Z41,2)","v":{"$error":"#NUM!"}},{"$f":"VLOOKUP(AB34,X34:Z41,3)","v":{"$error":"#NUM!"}},"PRO1:",{"$f":"IF(AM8=AM9, AC34, FORECAST(AM7,$AC$34:$AD$34,$AM$8:$AM$9))","v":{"$error":"#NUM!"}}]
[null,null,null,null,100,102,99,89,76,68,60,43,23,null,null,null,null,null,null,100,102,null,null,{"$f":"E35","v":100},{"$f":"HLOOKUP($AM$8,$F$32:$Q$41,4)","v":102},{"$f":"HLOOKUP($AM$9,$F$32:$Q$41,4)","v":102},"PRI2:",{"$f":"SMALL(E34:E41,COUNTIF(E34:E41,\"<\" &AM6)+1)","v":50},{"$f":"VLOOKUP(AB35,X34:Z41,2)","v":52},{"$f":"VLOOKUP(AB35,X34:Z41,3)","v":52},"PRO2:",{"$f":"IF(AM8=AM9, AC35, FORECAST(AM7,$AC$35:$AD$35,$AM$8:$AM$9))","v":52}]
[null,null,null,null,150,148,134,118,101,95,85,68,50,null,null,null,null,null,null,150,148,null,null,150,{"$f":"HLOOKUP($AM$8,$F$32:$Q$41,5)","v":148},{"$f":"HLOOKUP($AM$9,$F$32:$Q$41,5)","v":148},"PSI1:",{"$f":"LARGE(E34:E41,COUNTIF(E34:E41,\">\" &AM5)+1)","v":{"$error":"#NUM!"}},null,null,"PSO1:",{"$f":"VLOOKUP(AB36,E34:F41,2)","v":{"$error":"#NUM!"}}]
[null,null,null,null,200,171,150,134,118,110,101,82,61,41,null,null,null,null,null,200,171,null,null,200,{"$f":"HLOOKUP($AM$8,$F$32:$Q$41,6)","v":171},{"$f":"HLOOKUP($AM$9,$F$32:$Q$41,6)","v":171},"PSI2:",{"$f":"SMALL(E34:E41,COUNTIF(E34:E41,\"<\" &AM5)+1)","v":50},null,null,"PSO2:",{"$f":"VLOOKUP(AB37,E34:F41,2)","v":52}]
[null,null,null,null,250,188,167,155,132,123,121,94,72,51,null,null,null,null,null,220,174,null,null,250,{"$f":"HLOOKUP($AM$8,$F$32:$Q$41,7)","v":188},{"$f":"HLOOKUP($AM$9,$F$32:$Q$41,7)","v":188}]
[null,null,null,null,300,203,181,162,146,136,134,109,91,63,null,null,null,null,null,300,{"$f":"F39","v":203},null,null,300,{"$f":"HLOOKUP($AM$8,$F$32:$Q$41,8)","v":203},{"$f":"HLOOKUP($AM$9,$F$32:$Q$41,8)","v":203}]
[null,null,null,null,350,215,201,178,165,150,141,120,104,79,56,null,null,null,null,350,215,null,null,350,{"$f":"HLOOKUP($AM$8,$F$32:$Q$41,9)","v":215},{"$f":"HLOOKUP($AM$9,$F$32:$Q$41,9)","v":215}]
[null,null,null,null,400,247,210,192,172,162,155,136,115,94,85,null,null,null,null,400,247,null,null,400,{"$f":"HLOOKUP($AM$8,$F$32:$Q$41,10)","v":247},{"$f":"HLOOKUP($AM$9,$F$32:$Q$41,10)","v":247}]
[]
[]
[null,null,null,null,"Residual ","Static"]
[null,null,null,"Bonnet Setting","Inlet Pressure psig","OUTLET PRESSURES @ FLOW RATE, GPM",null,null,null,null,null,null,null,null,null,null,null,null,null,"Setting # 4: Inlet Pressure",null,null,null,"SETTING 4"]
[null,null,null,null,null,0,50,100,150,175,200,250,300,350,400,450,500,null,null,"Inlet (psig)","Static",null,null,"Inlet (psig)",{"$f":"CONCATENATE(\"Outlet Residual @ \" &AM$8& \" GPM\")","v":"Outlet Residual @ 0 GPM"},{"$f":"CONCATENATE(\"Outlet Residual @ \" &AM$9& \" GPM\")","v":"Outlet Residual @ 0 GPM"},null,null,"Const. PRI Interpolated @ Var. Flow"]
[null,null,null,4,0,0,0,0,0,0,0,0,0,0,0,0,0,null,null,{"$f":"E47","v":0},0]
[null,null,null,null,50,52,49,41,29,23,14,null,null,null,null,null,null,null,null,{"$f":"E48","v":50},{"$f":"F48","v":52},null,null,{"$f":"E48","v":50},{"$f":"HLOOKUP($AM$8,$F$46:$Q$55,3)","v":52},{"$f":"HLOOKUP($AM$9,$F$46:$Q$55,3)","v":52},"PRI1:",{"$f":"LARGE(E48:E55,COUNTIF(E48:E55,\">\" &AM6)+1)","v":{"$error":"#NUM!"}},{"$f":"VLOOKUP(AB48,X48:Z55,2)","v":{"$error":"#NUM!"}},{"$f":"VLOOKUP(AB48,X48:Z55,3)","v":{"$error":"#NUM!"}},"PRO1:",{"$f":"IF(AM8=AM9, AC48, FORECAST(AM7,$AC$48:$AD$48,$AM$8:$AM$9))","v":{"$error":"#NUM!"}}]
[null,null,null,null,100,102,100,92,78,72,62,42,24,null,null,null,null,null,null,100,102,null,null,{"$f":"E49","v":100},{"$f":"HLOOKUP($AM$8,$F$46:$Q$55,4)","v":102},{"$f":"HLOOKUP($AM$9,$F$46:$Q$55,4)","v":102},"PRI2:",{"$f":"SMALL(E48:E55,COUNTIF(E48:E55,\"<\" &AM6)+1)","v":50},{"$f":"VLOOKUP(AB49,X48:Z55,2)","v":52},{"$f":"VLOOKUP(AB49,X48:Z55,3)","v":52},"PRO2:",{"$f":"IF(AM8=AM9, AC49, FORECAST(AM7,$AC$49:$AD$49,$AM$8:$AM$9))","v":52}]
[null,null,null,null,150,152,146,133,121,110,103,83,64,38,null,null,null,null,null,150,152,null,null,150,{"$f":"HLOOKUP($AM$8,$F$46:$Q$55,5)","v":152},{"$f":"HLOOKUP($AM$9,$F$46:$Q$55,5)","v":152},"PSI1:",{"$f":"LARGE(E48:E55,COUNTIF(E48:E55,\">\" &AM5)+1)","v":{"$error":"#NUM!"}},null,null,"PSO1:",{"$f":"VLOOKUP(AB50,E48:F55,2)","v":{"$error":"#NUM!"}}]
[null,null,null,null,200,193,176,157,141,131,123,105,82,64,45,null,null,null,null,175,174,null,null,200,{"$f":"HLOOKUP($AM$8,$F$46:$Q$55,6)","v":193},{"$f":"HLOOKUP($AM$9,$F$46:$Q$55,6)","v":193},"PSI2:",{"$f":"SMALL(E48:E55,COUNTIF(E48:E55,\"<\" &AM5)+1)","v":50},null,null,"PSO2:",{"$f":"VLOOKUP(AB51,E48:F55,2)","v":52}]
[null,null,null,null,250,210,192,172,156,152,145,115,96,73,50,null,null,null,null,250,210,null,null,250,{"$f":"HLOOKUP($AM$8,$F$46:$Q$55,7)","v":210},{"$f":"HLOOKUP($AM$9,$F$46:$Q$55,7)","v":210}]
[null,null,null,null,300,219,212,194,172,168,151,131,111,85,59,null,null,null,null,300,219,null,null,300,{"$f":"HLOOKUP($AM$8,$F$46:$Q$55,8)","v":219},{"$f":"HLOOKUP($AM$9,$F$46:$Q$55,8)","v":219}]
[null,null,null,null,350,237,226,202,182,175,166,145,123,97,72,null,null,null,null,350,237,null,null,350,{"$f":"HLOOKUP($AM$8,$F$46:$Q$55,9)","v":237},{"$f":"HLOOKUP($AM$9,$F$46:$Q$55,9)","v":237}]
[null,null,null,null,400,252,234,218,197,193,175,155,135,108,83,62,null,null,null,400,252,null,null,400,{"$f":"HLOOKUP($AM$8,$F$46:$Q$55,10)","v":252},{"$f":"HLOOKUP($AM$9,$F$46:$Q$55,10)","v":252}]
[]
[]
[null,null,null,null,"Residual ","Static"]
[null,null,null,"Bonnet Setting","Inlet Pressure psig","OUTLET PRESSURES @ FLOW RATE, GPM",null,null,null,null,null,null,null,null,null,null,null,null,null,"Setting # 5: Inlet Pressure",null,null,null,"SETTING 5"]
[null,null,null,null,null,0,50,100,150,175,200,250,300,350,400,450,500,null,null,"Inlet (psig)","Static",null,null,"Inlet (psig)",{"$f":"CONCATENATE(\"Outlet Residual @ \" &AM$8& \" GPM\")","v":"Outlet Residual @ 0 GPM"},{"$f":"CONCATENATE(\"Outlet Residual @ \" &AM$9& \" GPM\")","v":"Outlet Residual @ 0 GPM"},null,null,"Const. PRI Interpolated @ Var. Flow"]
[null,null,null,5,0,0,0,0,0,0,0,0,0,0,0,0,0,null,null,{"$f":"E61","v":0},0]
[null,null,null,null,50,52,49,42,30,23,15,null,null,null,null,null,null,null,null,{"$f":"E62","v":50},{"$f":"F62","v":52},null,null,{"$f":"E62","v":50},{"$f":"HLOOKUP($AM$8,$F$60:$Q$69,3)","v":52},{"$f":"HLOOKUP($AM$9,$F$60:$Q$69,3)","v":52},"PRI1:",{"$f":"LARGE(E62:E69,COUNTIF(E62:E69,\">\" &AM6)+1)","v":{"$error":"#NUM!"}},{"$f":"VLOOKUP(AB62,X62:Z69,2)","v":{"$error":"#NUM!"}},{"$f":"VLOOKUP(AB62,X62:Z69,3)","v":{"$error":"#NUM!"}},"PRO1:",{"$f":"IF(AM8=AM9, AC62, FORECAST(AM7,$AC$62:$AD$62,$AM$8:$AM$9))","v":{"$error":"#NUM!"}}]
[null,null,null,null,100,101,100,92,80,71,61,42,null,null,null,null,null,null,null,100,101,null,null,{"$f":"E63","v":100},{"$f":"HLOOKUP($AM$8,$F$60:$Q$69,4)","v":101},{"$f":"HLOOKUP($AM$9,$F$60:$Q$69,4)","v":101},"PRI2:",{"$f":"SMALL(E62:E69,COUNTIF(E62:E69,\"<\" &AM6)+1)","v":50},{"$f":"VLOOKUP(AB63,X62:Z69,2)","v":52},{"$f":"VLOOKUP(AB63,X62:Z69,3)","v":52},"PRO2:",{"$f":"IF(AM8=AM9, AC63, FORECAST(AM7,$AC$63:$AD$63,$AM$8:$AM$9))","v":52}]
[null,null,null,null,150,151,149,141,129,123,113,90,62,38,null,null,null,null,null,150,151,null,null,150,{"$f":"HLOOKUP($AM$8,$F$60:$Q$69,5)","v":151},{"$f":"HLOOKUP($AM$9,$F$60:$Q$69,5)","v":151},"PSI1:",{"$f":"LARGE(E62:E69,COUNTIF(E62:E69,\">\" &AM5)+1)","v":{"$error":"#NUM!"}},null,null,"PSO1:",{"$f":"VLOOKUP(AB64,E62:F69,2)","v":{"$error":"#NUM!"}}]
[null,null,null,null,200,200,194,174,158,150,141,123,104,84,53,null,null,null,null,175,174,null,null,200,{"$f":"HLOOKUP($AM$8,$F$60:$Q$69,6)","v":200},{"$f":"HLOOKUP($AM$9,$F$60:$Q$69,6)","v":200},"PSI2:",{"$f":"SMALL(E62:E69,COUNTIF(E62:E69,\"<\" &AM5)+1)","v":50},null,null,"PSO2:",{"$f":"VLOOKUP(AB65,E62:F69,2)","v":52}]
[null,null,null,null,250,251,224,195,178,168,164,138,119,99,82,56,null,null,null,250,251,null,null,250,{"$f":"HLOOKUP($AM$8,$F$60:$Q$69,7)","v":251},{"$f":"HLOOKUP($AM$9,$F$60:$Q$69,7)","v":251}]
[null,null,null,null,300,299,250,209,192,183,177,155,130,109,85,62,null,null,null,300,299,null,null,300,{"$f":"HLOOKUP($AM$8,$F$60:$Q$69,8)","v":299},{"$f":"HLOOKUP($AM$9,$F$60:$Q$69,8)","v":299}]
[null,null,null,null,350,343,284,224,205,196,186,169,144,121,98,67,null,null,null,350,343,null,null,350,{"$f":"HLOOKUP($AM$8,$F$60:$Q$69,9)","v":343},{"$f":"HLOOKUP($AM$9,$F$60:$Q$69,9)","v":343}]
[null,null,null,null,400,379,330,239,218,213,211,178,158,130,102,77,null,null,null,400,379,null,null,400,{"$f":"HLOOKUP($AM$8,$F$60:$Q$69,10)","v":379},{"$f":"HLOOKUP($AM$9,$F$60:$Q$69,10)","v":379}]
[]
[]
[null,null,null,null,"Residual ","Static"]
[null,null,null,"Bonnet Setting","Inlet Pressure psig","OUTLET PRESSURES @ FLOW RATE, GPM",null,null,null,null,null,null,null,null,null,null,null,null,null,"Setting # 6: Inlet Pressure",null,null,null,"SETTING 6"]
[null,null,null,null,null,0,50,100,150,175,200,250,300,350,400,450,500,null,null,"Inlet (psig)","Static",null,null,"Inlet (psig)",{"$f":"CONCATENATE(\"Outlet Residual @ \" &AM$8& \" GPM\")","v":"Outlet Residual @ 0 GPM"},{"$f":"CONCATENATE(\"Outlet Residual @ \" &AM$9& \" GPM\")","v":"Outlet Residual @ 0 GPM"},null,null,"Const. PRI Interpolated @ Var. Flow"]
[null,null,null,6,0,0,0,0,0,0,0,0,0,0,0,0,0,null,null,{"$f":"E75","v":0},0]
[null,null,null,null,50,53,50,42,30,24,15,null,null,null,null,null,null,null,null,{"$f":"E76","v":50},{"$f":"F76","v":53},null,null,{"$f":"E76","v":50},{"$f":"HLOOKUP($AM$8,$F$74:$Q$83,3)","v":53},{"$f":"HLOOKUP($AM$9,$F$74:$Q$83,3)","v":53},"PRI1:",{"$f":"LARGE(E76:E83,COUNTIF(E76:E83,\">\" &AM6)+1)","v":{"$error":"#NUM!"}},{"$f":"VLOOKUP(AB76,X76:Z83,2)","v":{"$error":"#NUM!"}},{"$f":"VLOOKUP(AB76,X76:Z83,3)","v":{"$error":"#NUM!"}},"PRO1:",{"$f":"IF(AM8=AM9, AC76, FORECAST(AM7,$AC$76:$AD$76,$AM$8:$AM$9))","v":{"$error":"#NUM!"}}]
[null,null,null,null,100,101,99,92,79,72,63,43,null,null,null,null,null,null,null,100,101,null,null,{"$f":"E77","v":100},{"$f":"HLOOKUP($AM$8,$F$74:$Q$83,4)","v":101},{"$f":"HLOOKUP($AM$9,$F$74:$Q$83,4)","v":101},"PRI2:",{"$f":"SMALL(E76:E83,COUNTIF(E76:E83,\"<\" &AM6)+1)","v":50},{"$f":"VLOOKUP(AB77,X76:Z83,2)","v":53},{"$f":"VLOOKUP(AB77,X76:Z83,3)","v":53},"PRO2:",{"$f":"IF(AM8=AM9, AC77, FORECAST(AM7,$AC$77:$AD$77,$AM$8:$AM$9))","v":53}]
[null,null,null,null,150,152,150,143,130,123,112,91,66,35,null,null,null,null,null,150,152,null,null,150,{"$f":"HLOOKUP($AM$8,$F$74:$Q$83,5)","v":152},{"$f":"HLOOKUP($AM$9,$F$74:$Q$83,5)","v":152},"PSI1:",{"$f":"LARGE(E76:E83,COUNTIF(E76:E83,\">\" &AM5)+1)","v":{"$error":"#NUM!"}},null,null,"PSO1:",{"$f":"VLOOKUP(AB78,E76:F83,2)","v":{"$error":"#NUM!"}}]
[null,null,null,null,200,201,197,185,173,164,153,138,113,90,53,null,null,null,null,175,174,null,null,200,{"$f":"HLOOKUP($AM$8,$F$74:$Q$83,6)","v":201},{"$f":"HLOOKUP($AM$9,$F$74:$Q$83,6)","v":201},"PSI2:",{"$f":"SMALL(E76:E83,COUNTIF(E76:E83,\"<\" &AM5)+1)","v":50},null,null,"PSO2:",{"$f":"VLOOKUP(AB79,E76:F83,2)","v":53}]
[null,null,null,null,250,251,221,203,189,177,175,148,130,110,79,null,null,null,null,250,251,null,null,250,{"$f":"HLOOKUP($AM$8,$F$74:$Q$83,7)","v":251},{"$f":"HLOOKUP($AM$9,$F$74:$Q$83,7)","v":251}]
[null,null,null,null,300,300,291,272,240,224,200,174,150,127,105,86,null,null,null,300,300,null,null,300,{"$f":"HLOOKUP($AM$8,$F$74:$Q$83,8)","v":300},{"$f":"HLOOKUP($AM$9,$F$74:$Q$83,8)","v":300}]
[null,null,null,null,350,352,344,321,284,259,242,191,162,140,114,89,null,null,null,350,352,null,null,350,{"$f":"HLOOKUP($AM$8,$F$74:$Q$83,9)","v":352},{"$f":"HLOOKUP($AM$9,$F$74:$Q$83,9)","v":352}]
[null,null,null,null,400,401,391,369,325,309,275,223,177,152,123,96,65,null,null,400,401,null,null,400,{"$f":"HLOOKUP($AM$8,$F$74:$Q$83,10)","v":401},{"$f":"HLOOKUP($AM$9,$F$74:$Q$83,10)","v":401}]

{"sheet":"Charts 1.5\" Angle","index":17,"n_rows":2,"n_cols":2,"rows_kept":2,"cut":false,"hidden":false,"merged":[[1,1,2,7]]}
[]
[null,"1.5\" ANGLE"]